program: Gaussian 09
title: 000294677
version: EM64L-G09RevD.01
frameworkgroup: C1[X(C19H10N2O)]
method: RPBEPBE
basis: SDD
operation: Freq
keyword: #p
keyword: freq=noraman
keyword: PBEPBE/SDD
title: #p freq=noraman PBEPBE/SDD
converged: NO NO NO NO
title: Mulliken charges:
elementType: O N N C C C C C C C C C C C C C C C C C C C H H H H H H H H H H
charge: -0.128381 0.064114 0.104519 -0.188201 0.402390 -0.234977 0.312390 0.094550 0.073348 -0.197393 0.415463 0.411523 -0.582544 -0.565338 -0.415104 -0.401893 -0.410746 -0.406095 -0.213760 -0.219989 -0.233523 -0.236189 0.270947 0.276677 0.278884 0.283667 0.249701 0.251329 0.236743 0.239150 0.234036 0.234701
chargesum: 0.00000
title: Mulliken charges with hydrogens summed into heavy atoms:
elementType: O N N C C C C C C C C C C C C C C C C C C C
charge: -0.128381 0.064114 0.104519 -0.188201 0.402390 -0.234977 0.312390 0.094550 0.073348 -0.197393 0.415463 0.411523 -0.311597 -0.288661 -0.136220 -0.118225 -0.161045 -0.154767 0.022983 0.019161 0.000512 -0.001488
polarizability: 5.40873086e+02 4.30613813e-01 2.25149628e+02 -9.66352231e-03 -1.60525374e-02 7.94084720e+01
1716.lowfreq: -0.0009 -0.0002 0.0009 5.2351 6.8742 11.8152 45.7331 63.0966 111.0775
frequency: 45.7299 63.0929 111.0724 116.3577 144.6687 165.8676 215.0556 219.0171 254.9788 293.9818 300.5259 335.3993 388.3686 394.4501 436.6877 479.6137 483.0198 484.4920 494.1567 513.0957 530.8929 552.7728 597.3542 614.8551 627.2264 642.8914 654.0147 696.3800 733.2047 745.4970 750.4746 765.1749 774.4216 789.1467 810.6714 818.7000 861.1959 871.0053 903.5115 907.8570 912.0637 917.7498 933.9345 976.5767 980.6172 996.9266 997.7075 1006.1061 1014.5969 1032.8936 1078.7958 1103.7218 1120.9791 1156.0752 1171.4705 1174.1655 1175.9694 1192.1677 1231.3625 1242.4351 1270.9976 1273.0874 1304.0906 1343.8252 1372.0968 1399.9429 1411.8141 1428.1136 1441.0929 1449.3294 1459.8569 1483.6279 1532.6045 1543.7088 1559.8682 1592.9247 1604.3676 1607.7775 1638.3499 1647.0883 3123.6150 3129.0546 3133.4011 3145.1077 3147.2802 3149.2253 3152.6966 3159.3817 3163.0448 3169.3969
redmass: 5.9064 5.3096 5.0017 5.8040 6.3518 5.8817 5.9521 6.4902 8.0546 5.5601 7.1290 4.7388 5.6819 4.0030 4.2250 2.8666 8.6084 4.1612 4.4745 7.8886 7.8937 3.5050 8.7123 7.3173 8.1107 4.8751 7.8256 7.2694 6.6206 2.4705 6.6605 1.2635 1.9928 2.2531 3.4886 4.0482 3.2842 1.6660 5.8013 7.3425 1.4679 1.5607 1.9037 1.4067 1.4472 4.1592 1.3504 1.3625 2.3548 2.4216 2.6352 2.9482 2.8821 1.6738 1.3571 1.3531 1.5034 2.1570 1.6107 2.9709 1.9610 3.7601 1.9865 2.1248 4.6932 3.5965 3.8521 6.4193 3.1715 2.9180 2.9448 3.2327 9.8973 9.6123 7.0084 7.1992 6.5129 7.1975 7.6296 11.8216 1.0859 1.0891 1.0862 1.0956 1.0906 1.0921 1.0924 1.0955 1.1004 1.1000
irintensity: 1.7391 0.5243 0.1385 1.1859 0.6995 0.6018 0.0020 0.5084 1.4278 0.8966 2.0522 0.0399 0.1312 0.9611 4.8242 4.1740 7.8745 9.1947 24.2082 0.2306 0.1862 1.3990 0.3047 0.2433 1.2349 0.3032 4.2075 5.6623 4.8142 35.2677 2.0951 59.2507 36.6165 8.4303 0.1053 0.7680 6.8273 0.2907 16.7421 39.0109 33.1368 30.0518 0.2943 12.5398 4.1786 31.8946 0.0044 0.0326 1.5005 34.1052 5.0976 2.9455 6.7518 64.9468 3.4491 2.8892 3.2315 33.9513 4.8322 73.0896 7.9491 3.9525 1.6413 3.5838 10.4517 13.4971 10.3634 10.4957 3.9638 0.3764 10.5494 0.2117 124.7834 115.5276 7.1448 0.9517 13.6693 65.6253 16.3836 155.1082 1.2487 0.0366 1.6601 19.8133 6.1816 7.2034 0.7819 10.9477 50.1382 31.8674
temp: 298.150 k
press: 1.00000 atm
elementType: 8 7 7 6 6 6 6 6 6 6 6 6 6 6 6 6 6 6 6 6 6 6 1 1 1 1 1 1 1 1 1 1
symmnumber: 1
zpe: 615119.6 jmol-1
zpe.correction: 0.234287 hartree
zpe.thermalcorrener: 0.249184 hartree
zpe.thermalcorrenthalpy: 0.250128 hartree
zpe.thermalcorrgfe: 0.192238 hartree
zpe.sumelectzpe: -913.325381 hartree
zpe.sumelectthermal: -913.310484 hartree
zpe.sumelectthermalent: -913.309540 hartree
zpe.sumelectthermalfe: -913.367430 hartree
dipole: -1.6363 -4.0364 0.0009
dipole: 4.3554
quadrupole: -84.6164 -127.8590 -130.1762
quadrupole: -12.5035 0.0020 0.0015
quadrupole: 29.6008 -13.6418 -15.9590 -12.5035 0.0020 0.0015
hfenergy: -913.5596679 hartree
pointgroup: C01 [X(C19H10N2O1)]
dipole: 0.6409939 -1.5891456 -0.0003612 debye
polarizability: 540.87062|-0.9817858|225.1520941|-0.0096355|0.0160694|79.408472 unknown
InChI: InChI=1S/C19H10N2O/c22-19-14-8-4-3-7-13(14)17-18(19)21-16-10-12-6-2-1-5-11(12)9-15(16)20-17/h1-10H
charge 0 multiplicity 1
32 atoms
O  -2.954795 2.894147 0.000788
N  -0.37079 -1.246307 0.000081
N  -0.093048 1.687717 0.000269
C  -1.403702 -0.405175 0.0002
C  -2.843389 -0.723742 0.000125
C  -1.260973 1.056969 0.000305
C  -3.584828 0.497635 0.000252
C  0.893519 -0.621472 0.000077
C  1.031576 0.839176 0.000153
C  -2.649843 1.675703 0.000529
C  3.346989 -0.840518 -0.000026
C  3.482598 0.61262 0.000052
C  2.048441 -1.423378 -0.000009
C  2.313038 1.420921 0.000147
C  -3.505417 -1.966224 -0.000051
C  -4.991924 0.49483 0.000195
C  4.538443 -1.647947 -0.00011
C  4.801636 1.189992 0.00003
C  -4.923389 -1.969619 -0.000117
C  -5.660618 -0.754597 0.000004
C  5.799728 -1.055284 -0.000124
C  5.933228 0.377482 -0.000052
H  1.923232 -2.511344 -0.000062
H  2.38318 2.513789 0.000207
H  -2.935481 -2.900538 -0.000151
H  -5.546415 1.439218 0.000316
H  4.433971 -2.73953 -0.000152
H  4.897187 2.282364 0.000076
H  -5.460103 -2.925027 -0.000266
H  -6.755765 -0.785855 -0.000039
H  6.702523 -1.676275 -0.000182
H  6.93469 0.821765 -0.000068
