program: Gaussian 09
title: 000294662
version: EM64L-G09RevD.01
frameworkgroup: C1[X(C14H7Cl2NO2)]
method: RPBEPBE
basis: SDD
operation: Freq
keyword: #p
keyword: freq=noraman
keyword: PBEPBE/SDD
title: #p freq=noraman PBEPBE/SDD
converged: NO NO NO NO
title: Mulliken charges:
elementType: Cl Cl O O N C C C C C C C C C C C C C C H H H H H H H
charge: -0.026564 -0.035813 -0.265095 -0.179939 -0.054588 0.108445 0.179759 0.070849 0.283004 -0.325019 -0.328226 0.133105 -0.351169 -0.310021 -0.225621 -0.084881 -0.200097 -0.205668 -0.106121 0.277718 0.290107 0.280685 0.283642 0.267450 0.261807 0.262252
chargesum: 0.00000
title: Mulliken charges with hydrogens summed into heavy atoms:
elementType: Cl Cl O O N C C C C C C C C C C C C C C
charge: -0.026564 -0.035813 -0.265095 -0.179939 -0.054588 0.108445 0.179759 0.070849 0.283004 -0.047301 -0.038119 0.133105 -0.070484 -0.026379 0.041829 -0.084881 0.061709 0.056584 -0.106121
polarizability: 3.84014200e+02 4.57870031e+00 1.96818759e+02 1.00348142e-03 -3.75894807e-04 6.57302307e+01
1716.lowfreq: -0.0034 -0.0028 -0.0023 4.3621 4.8302 11.6464 38.5717 50.6029 64.3616
frequency: 38.4466 50.5874 64.3607 87.6323 99.2602 140.6420 170.1346 215.7771 226.9887 254.9211 264.0825 288.4540 326.7425 360.6624 385.5954 410.0566 434.9247 443.4546 484.2915 502.2847 566.0540 585.4764 585.8525 618.3893 627.6835 655.8775 676.0213 695.8896 729.7780 736.5906 766.7471 839.7803 840.4426 845.3989 852.3384 886.4577 896.9470 899.6297 978.9334 982.5631 990.0969 993.0677 1017.4509 1063.2286 1072.0003 1109.9143 1115.1076 1180.6910 1192.1112 1222.0559 1252.3857 1285.3284 1294.0623 1372.7304 1384.7553 1403.3328 1420.2212 1452.3417 1475.2300 1545.0505 1552.7103 1578.4859 1596.8447 1608.1936 1696.5901 3159.9315 3161.8097 3164.2230 3179.2823 3180.8564 3184.7733 3184.9990
redmass: 7.3005 4.7253 13.0785 9.8575 7.1542 13.0310 13.4112 11.8274 7.5621 9.2046 7.1613 12.5584 6.3068 5.3470 8.1323 2.9345 9.3017 3.2579 3.4582 12.1969 7.5642 9.1178 5.5026 8.0768 8.3177 4.7283 6.0311 7.3141 7.6831 3.8575 3.8214 1.4798 1.2569 10.4372 1.5718 7.1368 1.5088 9.4086 1.3471 1.3546 1.3588 6.0838 4.3764 2.0495 2.7587 1.4929 1.7518 1.1838 2.0986 2.5913 2.0639 2.5999 1.2565 5.5808 9.4377 4.0468 4.4741 2.7557 2.7182 9.2264 9.1706 8.0804 6.4842 7.2024 12.8723 1.0893 1.0888 1.0894 1.0969 1.0970 1.0975 1.0941
irintensity: 0.0159 0.0050 0.0223 2.9733 1.4956 0.1259 0.7095 2.5250 0.0178 2.4647 0.3232 0.0643 1.7643 4.6394 8.5953 0.0070 10.3835 1.3956 20.8159 9.4961 18.6798 18.0678 0.7953 4.0432 1.9466 31.9989 1.7986 19.1174 13.6697 7.5161 18.5359 30.2325 0.0994 72.7380 61.3310 61.5156 22.3331 144.8723 0.7980 1.2991 0.2050 95.4789 25.1379 49.9909 66.3738 20.0864 4.6803 49.3939 14.4363 54.4228 14.1377 35.8118 1.4735 23.7893 47.5473 22.3314 8.8620 224.4609 136.3030 353.8197 185.0502 86.6404 157.6715 64.4481 405.4471 1.0442 0.2730 1.2335 2.3039 0.7228 2.4691 0.3695
temp: 298.150 k
press: 1.00000 atm
elementType: 17 17 8 8 7 6 6 6 6 6 6 6 6 6 6 6 6 6 6 1 1 1 1 1 1 1
symmnumber: 1
zpe: 452224.4 jmol-1
zpe.correction: 0.172243 hartree
zpe.thermalcorrener: 0.187484 hartree
zpe.thermalcorrenthalpy: 0.188428 hartree
zpe.thermalcorrgfe: 0.128103 hartree
zpe.sumelectzpe: -1661.734850 hartree
zpe.sumelectthermal: -1661.719609 hartree
zpe.sumelectthermalent: -1661.718665 hartree
zpe.sumelectthermalfe: -1661.778990 hartree
dipole: -0.9340 -1.4332 0.0000
dipole: 1.7107
quadrupole: -118.7277 -127.9036 -124.7821
quadrupole: -1.5135 0.0007 0.0006
quadrupole: 5.0768 -4.0991 -0.9777 -1.5135 0.0007 0.0006
hfenergy: -1661.9070928 hartree
pointgroup: C01 [X(C14H7Cl2N1O2)]
dipole: 0.3452215 -0.5777617 -0.0003056 debye
dipolederiv: -0.5882187 0.3710221 0.0002313 0.5249935 -0.5225541 -0.0002803 0.0003023 -0.0002616 -0.0503906 -1.1352147 -0.1382497 0.0001032 -0.183797 -0.1368584 -0.0000043 0.0001064 -0.0000084 -0.0566873 -1.1935564 -0.654564 -0.0002077 -0.3977188 -0.9710325 -0.000322 -0.0001033 -0.0003786 -0.1551511 -0.4820045 -0.1216667 -0.000044 -0.2112255 -1.356669 -0.0004985 -0.0001041 -0.0004884 -0.3207794 -1.7406629 0.0151685 0.0001849 0.588213 -0.4415065 -0.0001826 0.0004368 -0.0000881 -0.2233234 -0.4643809 0.3810149 0.0002258 0.0478668 -0.5779162 -0.0002754 0.000031 -0.0003098 -0.0105908 1.3435178 0.0537883 -0.0000984 -0.3061966 0.3238613 0.0001476 -0.0002509 0.0001106 0.0866092 2.1056157 0.1823555 -0.0001835 -0.1192778 0.9329778 0.0003559 -0.000436 0.0003404 0.1482536 -0.7688314 -0.1078242 0.0000513 -0.1954581 -0.1227532 -0.0000195 0.0000654 -0.0000312 -0.0256193 0.0560543 -0.2951495 -0.0001577 0.1706575 0.1461138 0.0000974 0.0000845 0.0001252 -0.0822765 -0.8652215 0.1839319 0.000162 0.3639027 -0.1002418 -0.0000308 0.0002399 -0.0000121 -0.1091215 1.3437126 0.3034913 0.0000811 0.2992506 1.9189234 0.0007925 0.0001462 0.0008149 0.2914644 0.1668079 -0.061584 -0.0000699 0.3438917 0.0431182 0.0000074 0.0001226 0.0000683 -0.1012057 0.3534528 0.1295601 -0.0000172 -0.2471994 0.0127642 0.0000715 -0.0001573 0.00002 -0.1014543 -0.1987771 0.2141934 0.0001165 0.0352026 -0.4821621 -0.0001833 0.0000216 -0.0001982 -0.1168773 1.1595502 -0.5068362 -0.0003579 -0.6934828 0.9250825 0.0005409 -0.0004482 0.0005198 -0.0446681 -0.5916733 0.0747117 0.0000974 0.1799156 0.0294066 0.0000277 0.0001383 0.000044 -0.1055796 -0.5053217 -0.2176345 -0.0000315 -0.428148 -0.0936626 0.0000649 -0.0001077 0.0000452 -0.1040896 1.5552473 0.1975065 -0.0001654 0.2916704 0.2517872 0.0000757 -0.0001468 0.0000834 -0.0551354 0.0770899 0.0099607 0.0000108 -0.0525407 0.0096135 -0.0000681 -0.0000183 -0.0000734 0.1569615 0.1032017 -0.0423827 -0.0000148 -0.0295279 0.0331418 -0.0000632 -0.0000041 -0.0000619 0.169136 0.0925604 0.0776312 0.0000416 0.0644264 0.0488272 -0.0000475 0.000037 -0.0000529 0.1525286 0.1362976 -0.0425714 -0.0000077 -0.0452441 0.0171136 -0.0000465 -0.0000066 -0.0000471 0.1571268 -0.021333 -0.0189576 0.0000066 -0.0074003 0.0969591 -0.0000356 0.0000131 -0.0000331 0.1705336 0.0516524 -0.0501272 -0.0000041 -0.059474 -0.0136937 -0.0000603 -0.0000121 -0.000062 0.1651636 0.0104357 0.0632117 0.0000473 0.0667003 0.0293602 -0.0000637 0.0000502 -0.0000651 0.1651724 unknown
polarizability: 383.3733774|-11.8537618|197.4595501|-0.0430448|0.0600985|65.7302626 unknown
InChI: InChI=1S/C14H7Cl2NO2/c15-9-3-1-8(2-4-9)13-17-12-7-10(16)5-6-11(12)14(18)19-13/h1-7H
charge 0 multiplicity 1
26 atoms
Cl 5.267493 -2.565358 -0.00187
Cl -6.505005 -0.838663 0.000447
O  -0.154668 1.570339 0.000482
O  1.462277 3.221432 0.001275
N  0.380672 -0.785136 -0.000589
C  2.212311 0.895203 0.000076
C  1.747154 -0.462602 -0.000545
C  -0.496694 0.198836 -0.00012
C  -1.950764 -0.031507 0.000022
C  3.603667 1.172919 0.000108
C  2.693206 -1.521657 -0.001142
C  1.245556 2.000035 0.000685
C  -2.441792 -1.366411 -0.000398
C  -2.868264 1.054405 0.00059
C  4.537663 0.124411 -0.000481
C  4.058948 -1.210834 -0.001104
C  -3.825981 -1.616845 -0.000278
C  -4.256119 0.812497 0.00072
C  -4.715221 -0.520579 0.000281
H  3.933967 2.216317 0.000597
H  2.331007 -2.552329 -0.001615
H  -1.723426 -2.190909 -0.000825
H  -2.489378 2.079737 0.00091
H  5.612334 0.325224 -0.00047
H  -4.210199 -2.640763 -0.000616
H  -4.968147 1.642637 0.00116
