program: Gaussian 09
title: 000294661
version: EM64L-G09RevD.01
frameworkgroup: C1[X(C14H7Cl2NO2)]
method: RPBEPBE
basis: SDD
operation: Freq
keyword: #p
keyword: freq=noraman
keyword: PBEPBE/SDD
title: #p freq=noraman PBEPBE/SDD
converged: YES YES NO NO
title: Mulliken charges:
elementType: Cl Cl O O N C C C C C C C C C C C C C C H H H H H H H
charge: -0.003935 -0.028800 -0.228444 -0.177566 -0.061366 0.113558 0.175852 0.090521 0.383148 -0.326389 -0.329107 0.133845 -0.283687 -0.339584 -0.225225 -0.082372 -0.217814 -0.234338 -0.212222 0.277940 0.290032 0.275636 0.267166 0.261045 0.240728 0.241379
chargesum: 0.00000
title: Mulliken charges with hydrogens summed into heavy atoms:
elementType: Cl Cl O O N C C C C C C C C C C C C C C
charge: -0.003935 -0.028800 -0.228444 -0.177566 -0.061366 0.113558 0.175852 0.090521 0.383148 -0.048450 -0.039075 0.133845 -0.283687 -0.063948 0.041941 -0.082372 0.043231 0.006391 0.029157
polarizability: 3.25552988e+02 -7.06362565e+00 2.08920855e+02 -3.17693788e+00 2.90722193e+00 7.53777825e+01
1716.lowfreq: -0.0007 0.0010 0.0019 4.8601 6.1338 8.0442 19.8724 52.2567 74.0847
frequency: 19.8087 52.2529 74.0839 86.4066 110.9815 133.9912 167.6856 204.5484 228.8126 251.2285 263.2526 289.4857 302.0791 365.2437 392.6301 421.3739 438.4927 452.7456 496.1554 499.4809 562.2636 570.1880 586.8734 618.0092 645.9071 654.4453 680.1780 696.5474 728.0958 738.5169 764.8397 776.7015 839.6255 847.7326 878.5236 888.0679 895.4520 900.2174 966.5324 978.5047 996.1983 998.6287 1027.6937 1062.5652 1066.9522 1113.2380 1126.4764 1175.2190 1192.8793 1222.3476 1249.5266 1259.0811 1285.9594 1369.5317 1384.0718 1415.3585 1424.2863 1452.5998 1464.3426 1541.3081 1553.0997 1570.2777 1598.9378 1607.2472 1699.7029 3143.5764 3158.9336 3160.4404 3172.7560 3181.2522 3182.9797 3188.5596
redmass: 12.1019 5.8793 7.9768 10.5973 7.2340 6.8572 15.7595 7.3235 8.5427 8.1302 8.6649 12.6156 5.6029 6.7786 7.8292 7.5167 3.6124 3.4762 6.7723 5.8765 8.8105 7.6461 5.7225 8.8043 6.6405 4.8305 6.2382 7.3731 6.8972 3.1442 3.0288 1.6336 1.4999 8.8049 1.5232 5.4722 1.5187 8.5764 1.3768 1.3472 1.3491 7.5631 4.9657 1.9735 2.3001 2.0994 1.6791 1.0612 2.2051 2.3506 2.4125 1.4741 2.1766 8.3531 9.4315 3.2703 2.6887 2.7512 2.8619 9.5747 8.5840 6.8542 6.7671 7.3880 12.8918 1.0865 1.0908 1.0896 1.0947 1.1002 1.0968 1.0938
irintensity: 0.0571 1.2023 0.7892 2.3818 0.7643 0.0718 0.3871 1.1615 1.7638 0.2800 0.4080 0.1524 0.1323 2.9588 4.8416 6.0167 0.1388 10.2553 3.0277 1.3224 35.4002 7.4537 0.8817 4.4510 7.6294 25.7757 2.8815 13.3601 13.8512 15.2603 36.3957 37.6695 34.9195 73.1577 2.9686 76.0381 21.7094 96.4533 3.0556 0.8323 0.6239 35.4607 48.1972 42.9696 29.0044 11.3803 1.1026 3.1776 16.9749 43.5717 16.7571 8.3587 56.8880 0.6260 45.0943 31.1627 31.3286 161.0370 24.7081 377.2866 71.0907 99.6942 95.7533 55.8372 383.3473 1.8879 7.9421 0.9466 3.4343 16.7411 0.7319 0.4409
temp: 298.150 k
press: 1.00000 atm
elementType: 17 17 8 8 7 6 6 6 6 6 6 6 6 6 6 6 6 6 6 1 1 1 1 1 1 1
symmnumber: 1
zpe: 451674.0 jmol-1
zpe.correction: 0.172034 hartree
zpe.thermalcorrener: 0.187310 hartree
zpe.thermalcorrenthalpy: 0.188254 hartree
zpe.thermalcorrgfe: 0.127612 hartree
zpe.sumelectzpe: -1661.723049 hartree
zpe.sumelectthermal: -1661.707773 hartree
zpe.sumelectthermalent: -1661.706829 hartree
zpe.sumelectthermalfe: -1661.767471 hartree
dipole: 0.4857 -3.4629 -0.2173
dipole: 3.5036
quadrupole: -102.4057 -125.2892 -124.9039
quadrupole: -16.1182 0.4290 4.4230
quadrupole: 15.1272 -7.7563 -7.3710 -16.1182 0.4290 4.4230
hfenergy: -1661.895083 hartree
pointgroup: C01 [X(C14H7Cl2N1O2)]
dipole: -0.4617781 -1.0130509 0.8127086 debye
dipolederiv: -0.0816749 -0.0433584 0.0822186 0.0261053 -0.2343128 0.2978696 -0.0282385 0.3125655 -0.4833428 -0.5783911 0.3324869 -0.1721642 0.4509021 -0.4245953 0.1877496 -0.2292594 0.186764 -0.1461049 -1.063784 -0.5853553 0.2257715 -0.2679284 -0.8192985 0.2695346 0.1203934 0.2774715 -0.2399518 -0.4730674 -0.1109727 0.05275 -0.1477683 -1.147781 0.3621706 0.0601072 0.370531 -0.4729005 -1.5360515 0.0589643 -0.0708087 0.4500134 -0.4258473 0.0860022 -0.189218 0.0903081 -0.2601229 -0.4503781 0.3308173 -0.1641467 0.0803502 -0.4456976 0.1956765 -0.0280557 0.2190615 -0.1071507 1.1719679 0.0376626 0.0354276 -0.3046262 0.2650755 -0.0905167 0.1019702 -0.0863838 0.1252964 1.8319173 0.0698847 0.0436304 -0.0934946 0.8415082 -0.2303737 0.007625 -0.2911525 0.2369351 -0.5876999 -0.0821847 0.0335325 -0.148544 -0.1261504 0.1342808 0.0939514 0.141223 -0.1648121 0.0615932 -0.2512952 0.1168873 0.1429263 0.0960038 -0.0818857 -0.0643196 -0.0902937 -0.0406312 -0.7896857 0.1646953 -0.1018446 0.291294 -0.0948271 0.0061482 -0.1620846 -0.0028348 -0.1127982 1.2843824 0.2793901 -0.1176107 0.2017616 1.5904941 -0.572475 -0.0491449 -0.5947086 0.5466483 0.3628978 0.1993097 -0.2374333 -0.2037954 0.2839679 -0.5302059 0.184215 -0.4907722 0.6986979 0.0193917 -0.0099159 0.0342927 0.2314651 -0.0480343 -0.0512596 -0.1335862 -0.0488245 -0.0464058 -0.1754334 0.199381 -0.096345 0.0550487 -0.397936 0.1293746 -0.0316345 0.1377036 -0.1791289 1.097163 -0.4570486 0.2538136 -0.6014743 0.7226287 -0.3776613 0.3273911 -0.3775603 0.1416922 -0.167435 -0.1476029 0.20377 -0.1396809 -0.1737917 0.0963121 0.1913405 0.0896127 -0.2235729 -0.2558971 0.0767321 -0.1122256 0.0485341 -0.054363 -0.1229689 -0.1160288 -0.1154316 -0.021743 0.1037566 0.0008628 0.0312475 0.0260095 -0.0289369 -0.1258631 -0.0153782 -0.1381163 0.053622 0.0784952 0.0092638 -0.0081345 -0.0476994 0.0369959 0.055494 0.0205692 0.058124 0.129154 0.1037655 -0.0376097 0.0187397 -0.0271444 0.0582664 0.0499163 0.0037487 0.0528485 0.1427654 0.0914328 0.0360773 -0.0653895 0.0374936 0.106275 0.0599372 -0.0779241 0.0408449 0.0815913 -0.0217113 -0.0202201 0.0043154 -0.0084637 0.1102645 0.0276944 0.0008634 0.0287128 0.1561135 0.0205533 0.0230573 -0.0476034 0.0466552 0.1194179 0.0624629 -0.0675537 0.0683821 0.0653432 0.0529548 -0.0298983 0.0276937 -0.0591178 0.068176 0.1179556 0.0531439 0.1220716 0.0127236 -0.0990621 -0.0431231 0.0296157 -0.0388217 0.1224981 0.0446308 0.0271071 0.0398537 0.1080826 unknown
polarizability: 323.6646202|-11.1212021|162.4474763|12.4055502|-64.9490709|123.7395292 unknown
InChI: InChI=1S/C14H7Cl2NO2/c15-8-5-6-10-12(7-8)17-13(19-14(10)18)9-3-1-2-4-11(9)16/h1-7H
charge 0 multiplicity 1
26 atoms
Cl -2.846009 1.468758 -2.208663
Cl 5.059558 -2.23155 1.262096
O  -0.401074 1.408975 -0.582068
O  1.199447 2.926203 -1.274675
N  0.157707 -0.721021 0.394578
C  1.97264 0.834226 -0.280312
C  1.52177 -0.400524 0.293205
C  -0.727231 0.153496 -0.037707
C  -2.179794 -0.105926 0.078489
C  3.360484 1.111635 -0.375416
C  2.475353 -1.340878 0.76541
C  0.992345 1.817191 -0.761789
C  -3.198042 0.435507 -0.754837
C  -2.584173 -0.983649 1.128549
C  4.303667 0.182056 0.092811
C  3.837261 -1.032034 0.657728
C  -4.559096 0.140732 -0.529123
C  -3.937486 -1.282615 1.359861
C  -4.932054 -0.710379 0.532225
H  3.680322 2.060682 -0.816738
H  2.123746 -2.280849 1.196515
H  -1.794759 -1.415465 1.750394
H  5.37604 0.383216 0.026537
H  -5.315726 0.570897 -1.191215
H  -4.216768 -1.951988 2.17935
H  -5.991627 -0.928099 0.701993
