program: Gaussian 09
title: 000294653
version: EM64L-G09RevD.01
frameworkgroup: C1[X(C11H12N2O4)]
method: RPBEPBE
basis: SDD
operation: Freq
keyword: #p
keyword: freq=noraman
keyword: PBEPBE/SDD
title: #p freq=noraman PBEPBE/SDD
converged: YES YES NO NO
title: Mulliken charges:
elementType: O O O O N N C C C C C C C C C C C H H H H H H H H H H H H
charge: -0.285975 -0.240708 -0.204558 -0.215501 -0.439500 0.014353 0.162538 0.319608 0.192758 -0.489962 -0.480825 -0.316941 0.392940 -0.387337 -0.681755 0.213729 -0.783739 0.302587 0.245721 0.245199 0.324317 0.292537 0.380966 0.231074 0.219046 0.230622 0.246764 0.265606 0.246436
chargesum: 0.00000
title: Mulliken charges with hydrogens summed into heavy atoms:
elementType: O O O O N N C C C C C C C C C C C
charge: -0.285975 -0.240708 -0.204558 -0.215501 -0.058535 0.014353 0.162538 0.319608 0.192758 -0.187376 0.010095 0.007376 0.392940 -0.094800 -0.001013 0.213729 -0.024932
polarizability: 2.43849037e+02 -4.84841547e-01 1.87923373e+02 5.85543145e-03 1.85074274e-02 7.14325373e+01
1716.lowfreq: -45.6130 -8.5279 -4.1421 0.0003 0.0005 0.0010 2.4909 45.8620 54.4365
frequency: -45.5777 45.8518 54.4353 63.3541 90.2266 97.9630 119.0027 124.7642 149.5702 166.3215 197.1075 233.3311 266.3286 289.8160 312.0670 320.1516 391.2341 413.2904 428.7027 467.6933 507.9663 526.2700 573.5641 590.3179 595.1595 651.0158 667.4403 691.9978 733.1281 752.4049 802.3868 815.2265 854.4330 883.0952 924.8864 943.2797 967.3817 983.9055 991.0860 1019.2696 1021.4142 1038.1183 1072.1198 1082.4298 1111.1494 1131.8251 1205.5946 1212.4293 1232.6783 1254.2888 1261.0527 1298.1040 1331.0801 1362.7172 1381.4583 1388.3080 1399.4228 1420.6226 1437.0061 1443.5341 1455.0586 1463.3108 1469.5297 1477.8789 1518.4806 1570.6704 1580.5945 1621.2967 1645.3262 2976.2096 2993.7838 3002.5988 3021.9638 3078.3681 3099.9521 3105.6658 3128.4991 3140.3861 3177.5309 3184.4540 3195.9925
redmass: 1.0480 5.3929 7.9492 5.8230 2.4969 2.7304 3.8510 6.5970 3.0450 5.4173 1.4089 5.1925 6.2148 5.3693 5.3392 5.8472 7.6869 5.5563 3.3669 6.2155 3.1992 5.8355 2.8146 2.9547 5.6623 4.9939 6.1763 6.2501 6.8065 3.5400 4.8392 1.5223 5.8720 1.4576 5.8278 1.4451 4.4070 1.1168 1.7068 1.6141 1.3154 1.6657 1.6359 2.2294 2.9721 1.4728 5.1441 3.1259 2.5055 1.1727 1.9671 1.9946 2.1149 9.2783 1.2623 4.3354 1.2347 2.9720 2.0914 1.3325 1.3808 1.0460 1.0390 1.0580 3.1759 4.5013 5.0607 6.1738 3.0730 1.0607 1.0382 1.0363 1.0978 1.0977 1.1005 1.1001 1.0839 1.0989 1.0905 1.0913 1.0966
irintensity: 1.1092 0.0029 0.5349 0.0083 1.3486 12.1756 3.7024 2.6775 0.2850 0.1077 0.3950 5.3902 1.1062 0.7564 3.0956 0.9302 10.6499 0.1595 1.0500 11.9224 6.9185 3.2724 0.0175 0.0041 2.2297 12.4580 24.4683 21.5765 14.5944 0.4576 1.4575 8.6921 11.0122 45.8460 2.7988 12.2751 34.2352 71.1162 57.3238 3.9815 1.1106 20.9018 2.1060 19.1676 25.9656 26.3663 585.2313 388.8464 9.4545 0.4847 53.4339 44.5824 181.7079 115.7982 39.8926 105.2585 39.9385 28.4338 82.6177 43.9633 35.7103 19.2225 13.8366 9.5988 412.7552 50.6938 379.5618 206.0755 26.3957 24.9316 2.2353 26.0736 5.1625 9.4248 27.5856 27.5325 264.3623 6.6701 5.6093 2.8668 7.6882
temp: 298.150 k
press: 1.00000 atm
elementType: 8 8 8 8 7 7 6 6 6 6 6 6 6 6 6 6 6 1 1 1 1 1 1 1 1 1 1 1 1
symmnumber: 1
zpe: 572403.1 jmol-1
zpe.correction: 0.218017 hartree
zpe.thermalcorrener: 0.233755 hartree
zpe.thermalcorrenthalpy: 0.234699 hartree
zpe.thermalcorrgfe: 0.173927 hartree
zpe.sumelectzpe: -835.475875 hartree
zpe.sumelectthermal: -835.460137 hartree
zpe.sumelectthermalent: -835.459193 hartree
zpe.sumelectthermalfe: -835.519965 hartree
dipole: -4.0702 3.3307 -0.0021
dipole: 5.2593
quadrupole: -117.8371 -102.7466 -97.9991
quadrupole: 2.5533 0.0419 0.0209
quadrupole: -11.6428 3.4477 8.1951 2.5533 0.0419 0.0209
hfenergy: -835.6938919 hartree
pointgroup: C01 [X(C11H12N2O4)]
dipole: -1.657278 -1.2357548 -0.088672 debye
polarizability: 243.7833339|-1.9854865|187.4212534|0.193106|8.1109337|72.0003602 unknown
InChI: InChI=1S/C11H12N2O4/c1-3-11(15)9-6-8(13(16)17)4-5-10(9)12-7(2)14/h4-6,12H,3H2,1-2H3
charge 0 multiplicity 1
29 atoms
O  -2.055203 -1.9840 -0.216584
O  -2.700395 2.913638 0.12227
O  4.155653 1.708582 0.055667
O  4.12536 -0.569086 -0.105037
N  -2.164253 0.620475 -0.03288
N  3.53303 0.579213 -0.02585
C  -0.057275 -0.627739 -0.118199
C  -0.765881 0.638034 -0.030594
C  -0.775023 -1.934554 -0.212188
C  1.35858 -0.611412 -0.114064
C  0.023364 -3.234384 -0.304287
C  -0.022593 1.856341 0.055145
C  2.057619 0.601785 -0.027795
C  1.376096 1.840189 0.05684
C  -0.864791 -4.487458 -0.384969
C  -3.060828 1.706117 0.039121
C  -4.521736 1.275076 0.008002
H  1.939901 -1.533893 -0.177529
H  0.689898 -3.178203 -1.188784
H  0.699293 -3.298185 0.572522
H  -0.574981 2.794857 0.119759
H  1.953583 2.766189 0.122758
H  -2.55144 -0.348738 -0.096727
H  -1.524188 -4.451709 -1.26843
H  -0.237192 -5.393403 -0.45097
H  -1.513337 -4.573215 0.503035
H  -4.754195 0.730715 -0.925647
H  -5.158507 2.168643 0.071781
H  -4.755061 0.602824 0.853934
