program: Gaussian 09
title: 000294620
version: EM64L-G09RevD.01
frameworkgroup: C1[X(C14H13N3)]
method: RPBEPBE
basis: SDD
operation: Freq
keyword: #pfreq=noraman
keyword: PBEPBE/SDD
title: #p freq=noraman PBEPBE/SDD
converged: NO YES NO NO
title: Mulliken charges:
elementType: N N N C C C C C C C C C C C C C C H H H H H H H H H H H H H
charge: -0.470173 -0.187311 -0.691747 0.275037 0.177824 0.017677 0.215016 -0.573713 0.494807 -0.350219 -0.354791 0.291332 -0.330124 -0.820994 -0.410343 -0.302117 -0.210121 0.312097 0.238159 0.242937 0.227426 0.182168 0.230569 0.221252 0.230493 0.214260 0.224599 0.222915 0.289591 0.393491
chargesum: 0.00000
title: Mulliken charges with hydrogens summed into heavy atoms:
elementType: N N N C C C C C C C C C C C C C C
charge: -0.158076 -0.187311 -0.008664 0.275037 0.177824 0.017677 0.215016 -0.335554 0.494807 -0.107282 -0.127365 0.291332 -0.147956 -0.138680 -0.196083 -0.077518 0.012795
polarizability: 3.42856341e+02 8.89774658e+00 1.79431539e+02 2.12857492e-02 3.82257696e-03 7.22636011e+01
1716.lowfreq: -2.5408 0.0008 0.0009 0.0009 4.0842 4.3183 43.3041 59.3864 68.6460
frequency: 43.2183 59.3792 68.6353 110.6268 127.6416 195.5568 239.2968 253.8643 276.5131 288.3748 355.8108 362.0521 427.4383 444.1951 451.5305 472.1126 485.0422 533.7773 538.4408 552.2608 571.4135 605.1456 611.2164 666.8325 689.6877 740.5364 752.5473 752.5896 765.3630 814.6837 819.3386 838.1933 841.7170 862.4673 865.8576 916.3150 931.7345 939.8910 954.8657 965.4772 1001.8812 1029.7251 1044.9401 1048.6965 1081.7681 1130.7944 1159.7715 1160.4082 1176.0463 1226.8997 1252.0694 1266.8461 1289.4342 1305.4553 1336.8794 1345.5148 1386.2481 1397.0004 1399.9431 1439.2751 1459.0341 1469.2329 1472.8258 1489.9432 1499.2875 1530.5454 1562.6873 1588.0267 1612.9166 1629.8333 1641.3249 2972.6724 3050.0068 3079.0594 3108.1461 3119.1074 3125.0847 3132.3694 3141.2361 3161.8702 3165.2706 3191.0647 3614.3959 3627.1083
redmass: 4.1536 2.5835 1.2823 4.5697 3.8991 4.5490 4.2743 4.3163 4.8374 3.8733 3.4808 4.6416 2.5742 3.3182 1.3720 2.3450 6.4083 4.3470 3.0334 6.5354 1.2659 3.2737 6.0548 6.1961 4.6076 1.7409 5.5649 2.2552 3.7409 5.0965 1.4188 1.6791 5.3054 1.1005 1.4482 1.3900 5.1698 3.6142 1.3336 1.3208 1.5296 2.8346 1.5346 2.4859 1.7546 1.4303 2.0810 1.3148 1.0619 2.1932 1.8587 2.8398 1.9205 2.4057 2.8892 2.1807 3.5156 1.2724 5.7467 3.0754 4.1959 1.0460 1.2768 3.0717 2.7950 3.7194 3.0180 5.3110 2.0954 3.7014 6.4928 1.0371 1.0976 1.0987 1.0873 1.0871 1.0888 1.0923 1.0933 1.0959 1.0997 1.0677 1.0805 1.0865
irintensity: 3.2686 0.0955 0.1318 2.0470 0.3152 0.5650 0.0009 3.0597 1.7773 10.1682 6.4326 1.5939 0.4926 5.5879 133.1681 7.3062 0.6599 25.8975 0.0779 0.1589 79.9710 23.5344 0.7617 4.5745 6.2769 63.7382 3.5913 62.5449 0.3944 4.5534 38.4443 24.1070 2.4580 94.5300 11.6072 1.5000 0.6820 0.1530 1.7228 0.3543 11.7405 5.3505 13.2379 1.8513 23.1820 4.4742 1.5303 18.0978 13.5873 8.9154 47.2298 15.8386 1.5267 8.2225 0.2861 37.3015 7.4316 2.9048 139.3570 39.3670 8.7489 12.7898 24.2370 37.6165 70.5016 73.7473 11.5122 43.8357 100.2616 165.2040 52.4859 54.5825 22.0724 19.8045 19.3557 5.9461 18.2021 17.4373 33.9441 14.2378 32.7447 251.3508 30.5609 53.3499
temp: 298.150 k
press: 1.00000 atm
elementType: 7 7 7 6 6 6 6 6 6 6 6 6 6 6 6 6 6 1 1 1 1 1 1 1 1 1 1 1 1 1
symmnumber: 1
zpe: 628723.1 jmol-1
zpe.correction: 0.239468 hartree
zpe.thermalcorrener: 0.253317 hartree
zpe.thermalcorrenthalpy: 0.254261 hartree
zpe.thermalcorrgfe: 0.198580 hartree
zpe.sumelectzpe: -704.408573 hartree
zpe.sumelectthermal: -704.394724 hartree
zpe.sumelectthermalent: -704.393779 hartree
zpe.sumelectthermalfe: -704.449461 hartree
dipole: 0.5065 -1.3750 -0.0105
dipole: 1.4654
quadrupole: -84.5340 -82.8718 -107.6365
quadrupole: -5.0601 0.0246 -0.0177
quadrupole: 7.1467 8.8090 -15.9557 -5.0601 0.0246 -0.0177
hfenergy: -704.6480406 hartree
pointgroup: C01 [X(C14H13N3)]
dipole: -0.1904637 0.5439784 -0.0134645 debye
polarizability: 343.09237|6.271136|179.1629994|1.4808781|-1.5801426|72.2961116 unknown
InChI: InChI=1S/C14H13N3/c1-9-6-7-12-13(8-9)17-14(16-12)10-4-2-3-5-11(10)15/h2-8,17H,15H2,1H3
charge 0 multiplicity 1
30 atoms
N  -0.392703 1.146676 -0.07574
N  -0.160071 -1.116542 -0.038575
N  2.274538 -2.212379 -0.007073
C  -1.695669 0.63049 -0.075768
C  0.512679 0.068605 -0.053823
C  -1.529004 -0.793787 -0.052048
C  1.964191 0.222756 -0.047213
C  -2.964067 1.245259 -0.091706
C  -4.103684 0.406449 -0.084241
C  -2.669984 -1.627827 -0.044521
C  -3.938414 -1.015967 -0.060705
C  2.818097 -0.945015 -0.024028
C  2.570355 1.512179 -0.061076
C  -5.50281 0.999391 -0.100434
C  4.236167 -0.754244 -0.01783
C  3.964572 1.681861 -0.054443
C  4.797854 0.530726 -0.032915
H  -0.14153 2.131913 -0.092913
H  -3.078363 2.335095 -0.10928
H  -2.561086 -2.716578 -0.026206
H  -4.836766 -1.64535 -0.055285
H  1.939494 2.410426 -0.077369
H  -6.080171 0.692385 0.792398
H  -5.478491 2.102871 -0.119978
H  -6.072801 0.660548 -0.98641
H  4.884329 -1.639149 -0.000077
H  4.402039 2.684883 -0.064933
H  5.887921 0.644764 -0.026594
H  2.879822 -3.029586 0.00211
H  1.237559 -2.282155 -0.010525
