program: Gaussian 09
title: 000294601
version: EM64L-G09RevD.01
frameworkgroup: C1[X(C11H13NO4)]
method: RPBEPBE
basis: SDD
operation: Freq
keyword: #p
keyword: freq=noraman
keyword: PBEPBE/SDD
title: #p freq=noraman PBEPBE/SDD
converged: YES YES NO NO
title: Mulliken charges:
elementType: O O O O N C C C C C C C C C C C H H H H H H H H H H H H H
charge: -0.455165 -0.218431 -0.206964 -0.206923 0.027938 -0.166564 -0.283396 0.469876 -0.729002 0.259593 -0.406270 -0.353321 -0.789359 -0.360648 -0.357969 0.374791 0.240012 0.246768 0.236049 0.238825 0.229337 0.253821 0.278913 0.351215 0.231457 0.252805 0.267542 0.288063 0.287006
chargesum: 0.00000
title: Mulliken charges with hydrogens summed into heavy atoms:
elementType: O O O O N C C C C C C C C C C C
charge: -0.103950 -0.218431 -0.206964 -0.206923 0.027938 0.073448 -0.036627 0.469876 -0.024791 0.259593 -0.152449 -0.074409 -0.037554 -0.072585 -0.070963 0.374791
polarizability: 2.23359142e+02 3.70762464e+00 1.34130689e+02 8.39090561e+00 -1.51938052e+01 9.12304685e+01
1716.lowfreq: -2.0109 -0.0004 0.0001 0.0006 2.0691 11.5336 33.7238 39.8480 48.5445
frequency: 33.5959 39.8403 48.4359 62.0252 74.0509 134.6812 156.1394 161.4757 170.5124 215.4466 238.4329 238.8572 273.2227 287.4518 344.2937 351.3387 393.8406 410.9809 436.0387 483.1577 509.5540 531.4018 569.4374 586.2556 625.2434 658.4683 672.7294 738.3183 760.9404 790.5889 827.6695 856.5265 870.9486 900.0659 953.1222 965.0555 991.0042 999.0229 1002.9340 1006.5190 1040.2156 1080.0996 1091.5040 1102.6662 1110.4434 1170.0501 1176.2456 1202.5384 1219.4724 1230.5047 1273.3434 1291.1996 1306.0515 1326.3426 1341.6314 1362.0118 1368.1261 1389.7186 1404.1633 1420.9810 1443.8023 1450.4359 1474.9979 1476.8520 1482.1704 1595.9362 1605.9797 1636.2110 2971.1849 2979.5436 2990.8901 3020.1898 3064.8804 3087.3082 3095.9798 3123.2976 3137.4976 3154.2538 3182.1584 3184.5854 3568.4217
redmass: 4.9963 4.2115 6.2695 5.3320 5.1592 5.0538 6.5780 4.2347 1.1533 1.0843 3.5648 5.4457 3.1473 3.8258 2.1008 1.7572 4.8635 2.9072 3.3771 6.3986 5.6498 3.5815 4.2104 2.7755 6.9184 6.4551 4.6631 4.1430 5.1693 3.8549 2.9244 1.2560 1.7415 1.9861 1.9924 3.6995 1.3558 1.3901 2.1978 2.5104 1.7839 1.7128 3.2898 2.1817 1.3394 1.9661 1.2861 2.3233 5.5497 1.5373 1.5458 1.2879 1.5389 1.5633 1.3578 1.2919 5.7636 1.1951 6.8796 3.1332 1.0721 1.0549 1.0699 2.2641 1.0671 7.7282 6.2938 7.4492 1.0841 1.0366 1.0352 1.0854 1.0958 1.0994 1.1007 1.1008 1.0907 1.0898 1.0947 1.0955 1.0663
irintensity: 3.1823 1.2669 2.1512 6.7242 0.9707 0.7229 2.2688 1.5922 0.3092 0.7765 4.1788 0.7133 4.2761 6.0417 69.3419 90.1134 7.5973 1.2664 6.5832 13.8016 3.5967 8.7300 14.2961 2.5486 0.5890 3.8408 26.7356 5.2280 9.4454 42.9836 9.7518 3.5484 64.7929 6.6119 37.4807 37.9343 4.9755 0.1302 2.7635 3.4444 5.2711 6.9765 19.6464 17.4409 24.6439 55.1748 64.9935 4.6444 378.6818 21.0273 12.1376 4.2123 40.2985 23.2956 13.7394 65.3732 107.0932 18.4335 3.6440 48.1550 19.9464 21.5276 16.3651 3.4521 10.2472 2.1823 59.1017 109.5899 11.9199 2.3512 19.6557 17.0498 6.1894 29.2348 15.8935 19.7935 7.0187 1.3890 0.0673 2.8002 11.0743
temp: 298.150 k
press: 1.00000 atm
elementType: 8 8 8 8 7 6 6 6 6 6 6 6 6 6 6 6 1 1 1 1 1 1 1 1 1 1 1 1 1
symmnumber: 1
zpe: 586191.2 jmol-1
zpe.correction: 0.223268 hartree
zpe.thermalcorrener: 0.239349 hartree
zpe.thermalcorrenthalpy: 0.240293 hartree
zpe.thermalcorrgfe: 0.178429 hartree
zpe.sumelectzpe: -781.336991 hartree
zpe.sumelectthermal: -781.320911 hartree
zpe.sumelectthermalent: -781.319967 hartree
zpe.sumelectthermalfe: -781.381831 hartree
dipole: -3.2391 -1.2358 -0.0003
dipole: 3.4668
quadrupole: -134.4525 -92.0061 -88.3888
quadrupole: 7.8338 -9.8098 0.7769
quadrupole: -29.5034 12.9430 16.5604 7.8338 -9.8098 0.7769
hfenergy: -781.5602598 hartree
pointgroup: C01 [X(C11H13N1O4)]
dipole: 1.2686019 0.4375648 -0.243994 debye
polarizability: 223.1967286|-0.1194567|137.0643714|-10.2409529|-9.8773248|88.4591994 unknown
InChI: InChI=1S/C11H13NO4/c1-7(8(2)13)11(14)9-3-5-10(6-4-9)12(15)16/h3-7,11,14H,1-2H3
charge 0 multiplicity 1
29 atoms
O  2.030835 0.614196 -1.711398
O  4.3919 -1.103387 0.065399
O  -4.800624 -0.951685 0.522851
O  -4.699179 1.294781 0.138269
N  -4.152157 0.129104 0.240353
C  2.418159 0.209428 0.615085
C  1.587013 -0.267771 -0.609317
C  0.082786 -0.170308 -0.398961
C  2.110163 -0.606092 1.892044
C  3.912121 0.048549 0.236769
C  -0.680107 -1.326283 -0.092836
C  -0.570275 1.087239 -0.498922
C  4.730216 1.313313 0.077294
C  -2.069746 -1.239276 0.120874
C  -1.957372 1.194977 -0.289513
C  -2.688136 0.025542 0.020091
H  2.18968 1.27945 0.778803
H  1.874253 -1.320545 -0.817945
H  1.040233 -0.549146 2.156135
H  2.389967 -1.664484 1.745921
H  2.691761 -0.220748 2.748191
H  -0.183007 -2.30083 -0.025027
H  0.020261 1.972748 -0.754747
H  1.618045 0.311923 -2.559577
H  4.675006 1.934564 0.991721
H  5.780841 1.075923 -0.150352
H  4.290655 1.90801 -0.745957
H  -2.676384 -2.117554 0.355892
H  -2.481902 2.151461 -0.360737
