program: Gaussian 09
title: 000294655
version: EM64L-G09RevD.01
frameworkgroup: C1[X(C19H20N2O5)]
method: RPBEPBE
basis: SDD
operation: Freq
keyword: #p
keyword: freq=noraman
keyword: PBEPBE/SDD
title: #p freq=noraman PBEPBE/SDD
converged: YES YES NO NO
title: Mulliken charges:
elementType: O O O O O N N C C C C C C C C C C C C C C C C C C C H H H H H H H H H H H H H H H H H H H H
charge: -0.244511 -0.276521 -0.278730 -0.275609 -0.321442 -0.413971 -0.608615 -0.126905 -0.546957 0.154337 0.302012 -0.429544 0.294259 0.421898 -0.476256 0.469401 -0.368220 -0.404610 -0.384486 -0.372010 -0.234118 -0.218127 -0.243801 -0.225794 -0.228570 -0.233117 0.283646 0.292414 0.255697 0.370583 0.246893 0.241313 0.222500 0.240269 0.294180 0.227661 0.332184 0.381795 0.234232 0.268527 0.237160 0.227357 0.229679 0.227324 0.227377 0.229216
chargesum: 0.00000
title: Mulliken charges with hydrogens summed into heavy atoms:
elementType: O O O O O N N C C C C C C C C C C C C C C C C C C C
charge: -0.244511 -0.276521 -0.278730 -0.275609 -0.321442 -0.043389 0.105364 0.156741 0.001155 0.154337 0.302012 0.058661 0.294259 0.421898 -0.013488 0.469401 -0.074040 -0.176949 -0.150254 -0.103483 0.003042 0.009230 -0.014122 0.001530 -0.001193 -0.003901
polarizability: 2.77915136e+02 1.14738847e+01 2.02716930e+02 3.77301032e-01 -6.15494881e+00 1.98142314e+02
1716.lowfreq: -7.1061 -4.6678 -0.6780 -0.0001 0.0004 0.0007 8.3336 17.2047 20.6092
frequency: 7.4605 17.1374 20.5271 25.1584 32.8272 37.9968 49.9295 63.2441 84.3430 94.0111 111.4828 128.7389 150.5188 159.2554 194.4166 207.5034 228.3234 246.3776 258.6027 299.1059 301.1575 315.3797 346.0184 386.1770 398.3791 402.2309 404.0985 431.5043 463.1573 481.5666 541.4198 550.6188 573.3376 597.5484 608.1528 614.2882 617.5135 643.2594 655.0603 692.5769 700.1311 702.2802 705.1983 709.4816 722.2752 740.5564 758.0597 785.4010 796.0398 808.0646 815.7012 847.9405 858.2669 860.7154 875.8817 918.2558 934.5451 946.9259 959.9177 979.3150 982.5168 983.3583 987.9096 989.8122 993.3420 1000.0336 1001.8825 1017.9226 1023.6189 1026.4807 1026.9353 1089.3945 1090.7920 1106.8373 1131.2502 1171.8224 1173.1701 1173.3801 1188.5120 1191.6557 1203.5408 1205.9170 1210.3682 1221.4135 1238.8207 1242.3556 1268.6355 1306.1120 1319.6189 1329.7109 1346.2963 1347.5111 1350.5682 1385.1877 1385.6402 1387.4971 1436.8544 1437.7570 1442.3775 1447.4665 1458.3131 1467.9120 1484.4397 1484.8257 1584.1483 1594.3688 1595.4394 1614.2374 1614.8188 1624.7646 1635.4822 1650.2279 2988.8553 3020.5474 3026.3892 3035.8329 3088.0659 3109.8684 3115.3753 3120.1273 3120.7085 3127.1355 3129.7625 3139.3354 3141.1717 3150.1383 3151.9860 3164.1978 3166.0081 3323.4107 3463.4195 3613.5045
redmass: 5.6654 5.4403 6.2698 5.5760 3.9795 4.1097 7.7139 5.3875 6.0242 8.4168 8.8097 5.1125 5.6214 5.4968 6.5384 4.2686 5.9054 5.0704 5.1146 6.5748 3.0349 3.8889 2.8116 4.2549 3.3453 2.8554 2.8190 3.4446 3.0846 3.8910 3.2989 3.6049 5.0112 3.0871 2.6094 5.8312 6.1704 2.6497 4.1852 2.2930 2.1971 2.6730 2.3262 3.2706 2.5783 1.4911 2.2303 3.1412 4.1073 1.0816 3.4755 4.9794 1.2515 1.2662 4.4225 1.3899 1.5000 4.6994 2.7718 2.1698 1.4849 1.4542 4.8907 4.6158 3.6783 1.3376 1.4527 2.9479 2.2595 2.1896 2.2368 1.5969 1.5163 2.0588 1.9048 2.3182 1.0595 1.0792 1.1222 1.1438 1.6329 2.3441 1.9910 2.8824 1.1595 1.2727 1.5392 1.3912 1.4922 1.2573 1.3133 1.3249 1.5112 3.2901 5.8248 3.4536 1.2085 1.6390 2.1766 1.2090 1.3733 1.7393 2.2792 2.2588 3.0548 6.0983 5.2066 5.9766 6.0720 7.2430 2.5839 3.0639 1.0835 1.0572 1.0648 1.0587 1.1070 1.1071 1.0874 1.0861 1.0979 1.0875 1.0869 1.0922 1.0915 1.0964 1.0962 1.1016 1.1015 1.0628 1.0774 1.0907
irintensity: 0.0051 0.3420 0.3961 0.6323 0.0713 0.1593 0.1814 0.8861 1.0442 1.3979 6.7909 6.3933 1.7899 0.2137 12.3757 3.4413 9.0346 6.7084 16.1673 8.7379 18.7140 5.0372 14.5318 10.4093 7.1821 0.4604 0.2274 3.2644 15.0493 15.8536 15.9267 9.1150 41.7546 8.7873 63.0098 2.5418 1.0301 10.9485 15.1814 7.4566 28.1936 20.7761 46.2886 51.4816 82.4230 97.0612 45.6684 6.7406 2.1805 136.2104 9.7210 4.8228 0.1782 0.4287 23.9841 0.4013 13.4774 56.5972 102.0833 65.4062 6.7298 8.3811 2.7467 3.6805 44.5224 0.6862 5.7047 61.6451 25.0752 3.3956 3.7544 7.6994 4.6660 75.9347 119.2968 116.4565 1.4457 2.8491 2.0040 11.1720 114.2518 20.9782 63.1677 24.9471 12.3472 37.0109 40.2589 9.4097 78.1773 3.5017 43.0816 16.0835 51.6948 57.2910 12.5297 26.5311 27.3825 6.8722 10.8672 35.9941 137.2184 445.9794 24.2399 12.3294 338.4705 3.4843 23.1817 14.0258 0.6472 230.7027 48.4920 203.0607 14.7565 27.7842 5.3048 34.8974 4.7272 6.3734 7.9126 4.3927 1.2124 1.6827 2.8743 18.2452 25.2128 29.3746 12.1934 23.0427 22.8928 319.4092 170.8536 92.1419
temp: 298.150 k
press: 1.00000 atm
elementType: 8 8 8 8 8 7 7 6 6 6 6 6 6 6 6 6 6 6 6 6 6 6 6 6 6 6 1 1 1 1 1 1 1 1 1 1 1 1 1 1 1 1 1 1 1 1
symmnumber: 1
zpe: 949442.9 jmol-1
zpe.correction: 0.361624 hartree
zpe.thermalcorrener: 0.385791 hartree
zpe.thermalcorrenthalpy: 0.386735 hartree
zpe.thermalcorrgfe: 0.301879 hartree
zpe.sumelectzpe: -1219.801095 hartree
zpe.sumelectthermal: -1219.776928 hartree
zpe.sumelectthermalent: -1219.775984 hartree
zpe.sumelectthermalfe: -1219.860840 hartree
dipole: -1.5251 -1.7825 1.8051
dipole: 2.9600
quadrupole: -128.6766 -158.8397 -141.2579
quadrupole: -3.9717 -2.5624 4.2775
quadrupole: 14.2482 -15.9150 1.6668 -3.9717 -2.5624 4.2775
hfenergy: -1220.1627191 hartree
pointgroup: C01 [X(C19H20N2O5)]
dipole: -0.0310303 0.8922962 0.7476977 debye
polarizability: 226.0173431|37.4447787|253.4519798|-5.8429383|2.6410895|199.3050569 unknown
InChI: InChI=1S/C19H20N2O5/c20-18(23)16(11-17(22)25-12-14-7-3-1-4-8-14)21-19(24)26-13-15-9-5-2-6-10-15/h1-10,16,21H,11-13,20H2
charge 0 multiplicity 1
46 atoms
O  1.386063 1.536681 1.862344
O  -1.255774 -2.556832 -1.493264
O  3.243342 -3.111048 -1.142215
O  3.435254 1.161388 0.829452
O  -0.774405 -0.346661 -0.801919
N  0.853521 -2.027462 -0.827785
N  4.407702 -1.216427 -0.431795
C  1.943562 -1.142609 -0.437242
C  1.81074 -0.682621 1.063314
C  3.264818 -1.91723 -0.706423
C  2.320658 0.734207 1.238995
C  1.646886 3.00799 1.869619
C  -0.412937 -1.541841 -1.017813
C  1.260085 3.641932 0.541434
C  -2.700702 -2.174892 -1.654534
C  -3.492747 -2.440531 -0.392246
C  0.317676 3.035143 -0.326292
C  1.836362 4.886333 0.18572
C  -4.146777 -3.684535 -0.204205
C  -3.591099 -1.447963 0.617699
C  -0.041799 3.676348 -1.533902
C  1.465563 5.52954 -1.015977
C  0.523463 4.925038 -1.880511
C  -4.884084 -3.937893 0.97385
C  -4.327573 -1.700192 1.796204
C  -4.976152 -2.944802 1.976893
H  1.926621 -0.236133 -1.07503
H  0.750497 -0.712466 1.352356
H  2.375388 -1.368452 1.721146
H  1.11658 -2.984733 -1.09545
H  1.012555 3.362387 2.699487
H  2.710944 3.188363 2.104585
H  -3.030168 -2.814488 -2.488341
H  -2.738012 -1.110508 -1.943592
H  -0.123159 2.062705 -0.080063
H  2.58214 5.351183 0.843124
H  5.306466 -1.671554 -0.589449
H  4.355804 -0.257552 -0.050437
H  -4.074315 -4.455932 -0.980843
H  -3.077346 -0.490573 0.474548
H  -0.76337 3.193415 -2.201941
H  1.918534 6.491335 -1.281439
H  0.239934 5.418131 -2.817061
H  -5.386572 -4.902224 1.108907
H  -4.399215 -0.92801 2.570407
H  -5.550154 -3.138554 2.890183
