program: Gaussian 09
title: 000294580
version: EM64L-G09RevD.01
frameworkgroup: C1[X(C10H15NO2)]
method: RPBEPBE
basis: SDD
operation: Freq
keyword: #p
keyword: freq=noraman
keyword: PBEPBE/SDD
title: #p freq=noraman PBEPBE/SDD
converged: YES YES NO NO
title: Mulliken charges:
elementType: O O N C C C C C C C C C C H H H H H H H H H H H H H H H
charge: -0.220869 -0.221379 -0.334418 -0.127892 -0.076075 -0.049170 -0.489907 -0.473620 -0.522318 -0.516591 -0.749338 0.127048 0.124877 0.245411 0.252623 0.215172 0.230244 0.208863 0.224988 0.203402 0.247481 0.224293 0.222584 0.248527 0.219308 0.221150 0.213254 0.352353
chargesum: 0.00000
title: Mulliken charges with hydrogens summed into heavy atoms:
elementType: O O N C C C C C C C C C C
charge: -0.220869 -0.221379 0.017935 0.117519 0.176548 0.166002 -0.050800 -0.045231 -0.050543 -0.045480 -0.095627 0.127048 0.124877
polarizability: 1.30462662e+02 4.48293201e+00 1.30461422e+02 3.83581996e+00 -1.20106150e-01 8.32266249e+01
1716.lowfreq: -15.5455 -6.7106 -0.0006 0.0006 0.0008 11.8269 25.3047 103.9643 117.6331
frequency: 24.8692 103.9072 117.6292 150.1258 177.9036 195.1627 221.2769 280.1063 316.6421 328.9203 335.3679 398.8088 437.7878 475.8224 530.4796 550.7387 559.0274 578.8621 624.3206 686.6455 779.2069 812.7584 834.7090 837.7704 873.7127 903.1829 912.4212 926.8617 946.1624 966.4085 989.7316 1015.0572 1055.5266 1077.2178 1095.6280 1133.0717 1139.5471 1156.1505 1164.0103 1185.4148 1201.4796 1257.9863 1269.6965 1281.4967 1293.2684 1302.2549 1305.8707 1311.7432 1318.4063 1321.4498 1332.4847 1340.0786 1344.8193 1387.9970 1390.8635 1442.2773 1468.2053 1469.8139 1474.0216 1476.2889 1478.6777 1615.6179 1628.6981 2942.4702 2970.2467 2972.7520 2978.6225 2983.8745 2991.3268 2995.0979 3005.7242 3054.9922 3061.7964 3065.2004 3069.7156 3075.4203 3078.4440 3462.2751
redmass: 4.2055 3.8104 5.4760 3.8788 2.4394 1.7315 1.3903 3.6469 3.6878 3.6681 3.4855 3.2705 2.8122 2.6479 3.0114 2.6054 2.5304 3.8444 2.9510 4.6025 3.0770 1.9482 1.9731 1.9168 2.2671 1.5840 2.7292 1.9045 2.2201 1.4208 1.7993 2.6450 1.6357 2.1556 2.5334 2.0936 1.7304 1.8833 1.5481 1.6006 1.5370 1.3991 1.4122 1.4238 1.6060 1.3055 1.8237 1.5993 1.8344 1.3268 1.4929 1.5770 1.5973 1.8233 1.2137 1.0876 1.0837 1.0771 1.0544 1.0934 1.0521 10.1887 4.2610 1.0828 1.0366 1.0805 1.0664 1.0638 1.0699 1.0684 1.0784 1.0977 1.1006 1.1005 1.0994 1.0962 1.0964 1.0747
irintensity: 0.1097 0.9379 6.7424 1.4943 0.8323 0.2435 0.1684 5.2253 4.1732 0.0584 7.3000 5.7818 4.6325 5.2726 2.7599 5.5581 5.0549 19.0178 5.4283 6.9619 5.4712 43.0084 37.1958 8.8013 14.8240 1.5449 0.9016 0.6157 1.7161 2.9301 3.3594 0.5574 8.2761 22.3944 0.5863 11.8719 7.5771 3.6394 1.6641 86.4806 21.0114 18.3498 27.7689 23.0523 25.8775 19.9316 98.0279 102.9268 30.0401 0.9021 2.0677 19.6202 11.5497 2.1146 14.0649 16.9170 3.7168 11.3450 5.4881 13.4060 25.2772 167.4180 382.0592 12.9232 27.9005 14.9168 13.9243 42.4870 0.3615 4.2459 60.3484 36.1030 3.0075 52.1267 71.5156 22.3390 8.6023 32.8184
temp: 298.150 k
press: 1.00000 atm
elementType: 8 8 7 6 6 6 6 6 6 6 6 6 6 1 1 1 1 1 1 1 1 1 1 1 1 1 1 1
symmnumber: 1
zpe: 623974.6 jmol-1
zpe.correction: 0.237659 hartree
zpe.thermalcorrener: 0.249650 hartree
zpe.thermalcorrenthalpy: 0.250594 hartree
zpe.thermalcorrgfe: 0.199215 hartree
zpe.sumelectzpe: -594.289772 hartree
zpe.sumelectthermal: -594.277782 hartree
zpe.sumelectthermalent: -594.276837 hartree
zpe.sumelectthermalfe: -594.328217 hartree
dipole: 4.4215 -1.3133 1.1208
dipole: 4.7466
quadrupole: -87.6718 -91.3798 -75.3503
quadrupole: -2.0468 -1.5742 -0.5464
quadrupole: -2.8711 -6.5792 9.4503 -2.0468 -1.5742 -0.5464
hfenergy: -594.5274313 hartree
pointgroup: C01 [X(C10H15N1O2)]
dipole: -1.7471325 0.4948519 0.4359602 debye
polarizability: 130.3785886|4.4869312|130.569916|-3.6746897|0.1600699|83.2022046 unknown
InChI: InChI=1S/C10H15NO2/c1-6-2-3-7-4-9(12)11-10(13)5-8(6)7/h6-8,11H,2-5H2,1H3
charge 0 multiplicity 1
28 atoms
O  1.843507 -2.710676 -0.09978
O  3.101951 1.684027 -0.345522
N  2.268447 -0.450995 -0.155141
C  -0.864837 -0.374623 -0.2438
C  -0.433948 1.142048 -0.307554
C  -2.359136 -0.381921 0.225571
C  -1.687723 1.948087 0.152705
C  -2.879518 1.021725 -0.175732
C  0.015138 -1.274282 0.662436
C  0.820568 1.516312 0.523064
C  -3.181872 -1.556522 -0.334744
C  1.412731 -1.544969 0.123535
C  2.12901 0.95148 -0.012324
H  -0.828584 -0.796388 -1.268228
H  -0.222863 1.400644 -1.363302
H  -2.368374 -0.43908 1.336408
H  -1.749954 2.935641 -0.337763
H  -1.64324 2.124583 1.24657
H  -3.806113 1.300403 0.357508
H  -3.098483 1.043556 -1.262327
H  -0.454891 -2.267055 0.767627
H  0.080741 -0.838739 1.678681
H  0.681007 1.20963 1.578178
H  0.950332 2.612016 0.520926
H  -2.746283 -2.533466 -0.053041
H  -4.220555 -1.533967 0.043623
H  -3.223676 -1.513001 -1.4398
H  3.185721 -0.734268 -0.527374
