program: Gaussian 09
title: 000294594
version: EM64L-G09RevD.01
frameworkgroup: C1[X(C12H16N2O4S)]
method: RPBEPBE
basis: SDD
operation: Freq
keyword: #p
keyword: freq=noraman
keyword: PBEPBE/SDD
title: #p freq=noraman PBEPBE/SDD
converged: YES YES NO NO
title: Mulliken charges:
elementType: S O O O O N N C C C C C C C C C C C C H H H H H H H H H H H H H H H H
charge: 0.163678 -0.429520 -0.232683 -0.209485 -0.211021 -0.627508 0.025942 -0.095855 -0.130247 -0.666325 -0.700531 -0.893428 0.207005 0.555034 -0.311750 -0.408671 -0.356308 -0.351751 0.370255 0.255765 0.234420 0.239410 0.211321 0.229363 0.208625 0.273821 0.304289 0.278562 0.293716 0.308674 0.260903 0.250519 0.286230 0.286872 0.380679
chargesum: 0.00000
title: Mulliken charges with hydrogens summed into heavy atoms:
elementType: S O O O O N N C C C C C C C C C C C C
charge: 0.163678 -0.048841 -0.232683 -0.209485 -0.211021 -0.025118 0.025942 -0.095855 0.125518 0.018826 0.011277 -0.310577 0.207005 0.555034 -0.050847 -0.158151 -0.070078 -0.064879 0.370255
polarizability: 2.51346232e+02 8.19490486e+00 1.61741052e+02 -1.39592454e+01 -3.93329910e+00 1.41622304e+02
1716.lowfreq: -10.1087 -5.4955 -0.0013 -0.0006 -0.0005 9.5307 12.3475 30.4251 33.5214
frequency: 9.2205 30.1973 33.4284 55.3968 69.8099 86.7077 100.8035 102.4667 148.1433 173.9841 201.7286 204.9746 216.0199 244.9008 246.1518 260.7849 273.6861 301.9784 314.3216 325.6822 335.2216 360.6945 365.5021 394.7706 405.4213 409.4194 453.5388 484.4516 505.6908 590.5872 602.6629 611.4633 623.5837 643.2960 655.0110 674.7640 694.3030 740.7750 761.2876 786.1760 819.4301 846.1826 847.5625 851.1843 898.3111 938.6264 960.5509 987.8007 994.3518 995.1942 1005.1030 1047.5371 1092.6271 1093.8599 1104.6237 1108.4090 1140.1148 1159.1475 1178.2873 1180.2492 1204.8748 1215.4207 1221.3940 1238.1892 1254.6434 1301.3545 1324.8344 1363.0501 1374.0577 1381.4954 1393.7080 1401.3315 1416.6006 1457.6820 1461.0439 1462.6159 1478.7438 1479.2155 1483.0578 1593.0072 1605.0934 1605.3836 1670.4203 2976.8378 2988.2650 3014.8295 3038.3916 3070.0066 3078.0442 3092.3040 3099.8198 3107.7651 3134.7024 3146.8147 3180.8991 3183.3975 3497.1399 3526.7486 3674.0246
redmass: 6.3727 5.8867 6.3603 7.2381 5.9453 5.0680 6.9116 4.9342 7.4735 3.9318 1.7456 1.1284 3.9894 2.4501 1.4649 3.5735 1.6236 4.1381 2.8708 3.2035 3.3225 3.3568 4.7725 1.6767 2.7724 3.1089 3.7720 3.7205 7.3561 2.5075 3.3310 2.0238 6.9750 3.2015 6.0611 4.2959 3.4954 4.3869 7.5235 3.4933 5.6488 3.0471 1.6257 1.2459 1.7796 1.4342 2.4339 1.3432 1.2971 1.3673 3.0491 2.5391 2.6228 1.9724 1.3342 1.8012 2.3522 1.2197 1.9787 1.4178 2.5368 2.5131 5.7103 1.4813 1.5735 1.2805 1.3983 7.1556 1.2582 1.5627 1.1958 8.3759 3.2692 1.1320 1.0560 1.0512 1.2580 1.6472 1.0844 7.6015 2.8751 1.5506 5.1162 1.0382 1.0365 1.0613 1.0856 1.0957 1.0976 1.1026 1.0998 1.0999 1.0907 1.0903 1.0943 1.0955 1.0637 1.0441 1.1023
irintensity: 0.8954 0.5457 1.4875 1.9307 0.2437 5.0371 0.6760 4.0728 2.6325 2.6777 39.4183 25.2885 10.5294 7.6533 40.2538 1.6518 55.8478 2.5194 23.5272 6.3087 10.7593 3.6728 3.1806 150.6353 20.6772 4.4828 20.6899 4.0541 0.6743 21.6699 28.0500 96.1903 0.5451 3.8590 0.7288 39.1341 92.1478 1.2493 29.9486 2.6283 3.1686 11.4419 29.4624 0.5144 25.8885 1.7399 39.6520 2.6449 1.2521 0.3992 3.2260 185.9498 19.7753 20.3268 24.1862 59.7214 5.4348 10.4658 25.9301 61.7784 7.7794 18.7346 322.6277 1.3096 0.7976 0.4624 8.5956 86.6954 20.1591 13.2681 28.6638 5.2252 50.2615 13.8256 13.1215 0.2508 10.3071 7.4084 21.3006 4.5980 124.0325 51.8911 166.5117 22.7409 27.5697 5.8572 13.2359 18.7391 26.9509 1.4908 14.0237 8.5104 9.4758 2.6184 0.1931 3.2947 22.4884 19.1346 14.6243
temp: 298.150 k
press: 1.00000 atm
elementType: 16 8 8 8 8 7 7 6 6 6 6 6 6 6 6 6 6 6 6 1 1 1 1 1 1 1 1 1 1 1 1 1 1 1 1
symmnumber: 1
zpe: 705470.0 jmol-1
zpe.correction: 0.268699 hartree
zpe.thermalcorrener: 0.289131 hartree
zpe.thermalcorrenthalpy: 0.290075 hartree
zpe.thermalcorrgfe: 0.217466 hartree
zpe.sumelectzpe: -1273.820743 hartree
zpe.sumelectthermal: -1273.800311 hartree
zpe.sumelectthermalent: -1273.799367 hartree
zpe.sumelectthermalfe: -1273.871976 hartree
dipole: 3.7709 -0.3850 -0.6845
dipole: 3.8518
quadrupole: -166.4384 -118.9695 -107.8986
quadrupole: -5.5286 8.2824 2.3303
quadrupole: -35.3363 12.1327 23.2036 -5.5286 8.2824 2.3303
hfenergy: -1274.0894424 hartree
pointgroup: C01[X(C12H16N2O4S1)]
dipole: -1.4010477 0.4894423 0.3065428 debye
polarizability: 240.9146781|-35.4790588|156.9614989|-3.3699427|-8.1607488|156.833411 unknown
InChI: InChI=1S/C12H16N2O4S/c1-12(2,10(13)11(15)16)19-7-8-3-5-9(6-4-8)14(17)18/h3-6,10,15H,7,13H2,1-2H3
charge 0 multiplicity 1
35 atoms
S  -1.827603 1.389429 -0.875841
O  -3.283079 1.351261 2.303718
O  -5.122761 0.8121 0.99717
O  4.933534 -1.648034 -1.011116
O  4.564484 -2.450659 1.092517
N  -3.846058 -1.800292 1.081154
N  4.249262 -1.707323 0.083364
C  -2.606154 -0.376491 -0.656348
C  -3.075542 -0.580968 0.837878
C  -1.58908 -1.47204 -1.037521
C  -3.784112 -0.357832 -1.655613
C  -0.525572 1.577018 0.50834
C  -3.942139 0.581944 1.33609
C  0.706754 0.709951 0.379687
C  1.500431 0.731689 -0.799953
C  1.106832 -0.122468 1.459411
C  2.662299 -0.052461 -0.904965
C  2.266549 -0.918566 1.373863
C  3.028491 -0.872982 0.187018
H  -2.170188 -0.616425 1.468996
H  -0.73529 -1.510125 -0.339226
H  -1.192731 -1.290622 -2.050791
H  -2.083858 -2.463012 -1.036143
H  -3.413884 -0.173972 -2.679851
H  -4.284657 -1.344083 -1.65317
H  -4.530829 0.412061 -1.402434
H  -1.029489 1.454828 1.47957
H  -0.262886 2.645454 0.399283
H  -3.342681 -2.683457 1.127119
H  -4.793829 -1.828632 0.705464
H  1.184903 1.357672 -1.641493
H  0.509631 -0.13832 2.378446
H  3.285519 -0.046285 -1.803082
H  2.58865 -1.563314 2.195827
H  -3.888813 2.081058 2.610129
