program: Gaussian 09
title: 000294595
version: EM64L-G09RevD.01
frameworkgroup: C1[X(C13H18N2O4S)]
method: RPBEPBE
basis: SDD
operation: Freq
keyword: #p
keyword: freq=noraman
keyword: PBEPBE/SDD
title: #p freq=noraman PBEPBE/SDD
converged: NO YES NO NO
title: Mulliken charges:
elementType: S O O O O N N C C C C C C C C C C C C C H H H H H H H H H H H H H H H H H H
charge: 0.156511 -0.429786 -0.232277 -0.210696 -0.210369 -0.595334 0.027322 -0.063145 -0.171248 -0.670860 -0.717921 -0.659494 -0.535173 0.178865 0.506002 -0.363124 -0.392159 -0.358213 -0.351051 0.367283 0.265811 0.207478 0.230471 0.251823 0.231537 0.224965 0.270518 0.260608 0.288342 0.233232 0.232809 0.286784 0.297180 0.248452 0.248760 0.285096 0.285647 0.375356
chargesum: 0.00000
title: Mulliken charges with hydrogens summed into heavy atoms:
elementType: S O O O O N N C C C C C C C C C C C C C
charge: 0.156511 -0.054430 -0.232277 -0.210696 -0.210369 -0.011370 0.027322 -0.063145 0.094563 0.018912 0.009099 -0.110544 -0.069132 0.178865 0.506002 -0.114672 -0.143399 -0.073117 -0.065405 0.367283
polarizability: 2.77217294e+02 1.24773208e+01 1.77952670e+02 1.80882372e+01 -5.70776088e+00 1.38493614e+02
1716.lowfreq: -18.3271 -6.5661 -0.0019 -0.0013 -0.0007 3.0846 11.6339 17.5952 26.7965
frequency: 7.9826 16.2437 26.7221 38.3551 65.1146 66.9293 80.4558 93.4454 114.6529 138.2262 162.2409 189.0345 199.8674 211.2985 235.0996 236.6061 251.8226 271.9356 291.7526 307.7861 327.0944 338.0338 347.2282 358.6104 387.0139 398.0907 408.1575 460.2763 504.8074 508.0333 586.9578 591.6536 614.3264 628.0383 642.5093 649.5693 667.4031 686.1739 698.1569 738.3132 776.8203 787.6198 790.2679 822.1327 852.4382 864.4583 871.7615 944.8793 963.8701 973.5575 986.8142 995.1692 998.9013 1005.8095 1025.0450 1035.7771 1082.4497 1093.0033 1096.6812 1106.7337 1136.0684 1149.6350 1180.5060 1191.7695 1214.5478 1222.5681 1224.5969 1241.7363 1247.1254 1271.1996 1301.8286 1315.4368 1322.4166 1364.7429 1371.7697 1376.9659 1390.0476 1402.5197 1419.7369 1452.9177 1462.6535 1469.8272 1475.9904 1479.5907 1484.7915 1488.3806 1595.9287 1607.8043 1639.3830 1652.7857 2982.3698 2989.1361 2998.6923 3019.9786 3055.9413 3056.4993 3074.1707 3082.4503 3095.4474 3100.0009 3101.9841 3137.4747 3141.1103 3181.4205 3183.7936 3466.3910 3492.0925 3595.5674
redmass: 5.1876 5.5469 6.6141 4.4861 7.2527 6.9388 6.4366 4.1689 2.8895 6.8800 5.5474 1.7386 1.8798 5.3532 3.2532 1.2088 3.0153 3.0081 1.3989 2.4335 4.2934 2.9208 2.9968 3.8380 5.0006 4.2428 2.8917 4.4875 4.2748 4.9385 2.4284 1.4075 6.8828 6.8858 2.9907 1.7385 5.0062 3.6004 5.1469 5.3049 5.7054 1.8928 1.5374 3.9332 1.2451 3.6545 1.8850 1.4367 2.5962 1.4658 1.3608 1.3727 1.3356 3.0619 4.0926 2.2253 2.1763 3.2223 1.2901 1.7707 1.1138 2.3416 1.3332 1.8534 2.4867 6.1923 2.3373 1.2576 1.9923 1.2111 1.2805 1.3846 1.6452 7.3985 1.2192 1.2849 1.1962 8.2925 3.2895 1.0604 1.0739 1.0498 1.0604 2.0629 1.1963 1.0519 7.6611 6.3534 1.1957 4.9088 1.0350 1.0356 1.0596 1.0552 1.0887 1.0997 1.0985 1.0986 1.1001 1.1092 1.1005 1.0905 1.0907 1.0943 1.0954 1.0450 1.0637 1.0985
irintensity: 0.0088 1.1446 1.5511 0.4656 0.1748 0.2600 2.6785 0.2392 2.8190 2.9215 0.6387 0.6892 2.8523 1.6946 3.6716 2.8522 2.0400 3.0069 25.9586 15.4569 1.3051 9.5404 1.5787 4.2318 1.7592 2.1106 0.0233 17.0915 8.1329 5.9515 9.1512 128.9640 1.4085 0.1822 90.6424 118.5353 15.6032 66.3688 36.9634 13.0322 14.7647 0.6681 6.1172 14.7499 0.2182 13.0606 39.5289 3.0131 45.3311 7.8222 2.8320 0.1406 0.6741 3.4979 4.8351 165.6453 36.9576 17.4162 14.1838 50.3194 9.5925 35.5206 71.1787 5.2487 0.1066 327.2615 12.9080 4.2950 8.0869 1.7940 1.7461 11.5103 22.1438 95.4823 25.6183 4.0416 32.0224 0.1143 44.4074 3.1898 5.0712 1.5938 10.5066 9.6260 7.1275 20.2438 2.0595 79.4166 96.2473 158.6357 18.8252 23.4608 10.2619 23.3078 8.0958 5.9397 28.2100 18.2664 17.6667 9.0368 12.1256 11.3604 7.6212 0.0442 3.9152 4.1801 15.8995 8.4702
temp: 298.150 k
press: 1.00000 atm
elementType: 16 8 8 8 8 7 7 6 6 6 6 6 6 6 6 6 6 6 6 6 1 1 1 1 1 1 1 1 1 1 1 1 1 1 1 1 1 1
symmnumber: 1
zpe: 780742.8 jmol-1
zpe.correction: 0.297369 hartree
zpe.thermalcorrener: 0.319085 hartree
zpe.thermalcorrenthalpy: 0.320030 hartree
zpe.thermalcorrgfe: 0.242878 hartree
zpe.sumelectzpe: -1313.046579 hartree
zpe.sumelectthermal: -1313.024862 hartree
zpe.sumelectthermalent: -1313.023918 hartree
zpe.sumelectthermalfe: -1313.101070 hartree
dipole: -4.4542 -0.0698 0.1730
dipole: 4.4581
quadrupole: -174.9469 -117.8223 -126.7425
quadrupole: -8.4060 -18.7362 -0.7647
quadrupole: -35.1097 22.0149 13.0947 -8.4060 -18.7362 -0.7647
hfenergy: -1313.3439477 hartree
pointgroup: C01 [X(C13H18N2O4S1)]
dipole: 1.7479192 -0.0973462 -0.1081482 debye
polarizability: 277.0766766|-14.8141063|179.5163196|15.6380414|2.646184|137.0705818 unknown
InChI: InChI=1S/C13H18N2O4S/c1-13(2,11(14)12(16)17)20-8-7-9-3-5-10(6-4-9)15(18)19/h3-6,11,16H,7-8,14H2,1-2H3
charge 0 multiplicity 1
38 atoms
S  2.458699 -1.1669 1.09018
O  2.577372 2.208673 0.239832
O  4.788313 1.685387 0.721535
O  -5.877831 1.798621 -0.549353
O  -6.371751 -0.414593 -0.796878
N  4.615228 0.563381 -2.065138
N  -5.574625 0.545574 -0.461953
C  3.6153 -1.080796 -0.4611
C  3.584753 0.379952 -1.029166
C  3.151493 -2.07174 -1.543518
C  5.003311 -1.474786 0.089039
C  0.760976 -0.69324 0.390399
C  -0.284093 -0.850522 1.523839
C  3.739471 1.431835 0.086962
C  -1.676803 -0.490384 1.031321
C  -2.070638 0.870596 0.914966
C  -2.597079 -1.501352 0.646186
C  -3.343275 1.221482 0.427728
C  -3.876122 -1.174079 0.155431
C  -4.230891 0.188545 0.05204
H  2.59802 0.538026 -1.496454
H  2.115193 -1.874664 -1.873381
H  3.20423 -3.106832 -1.164979
H  3.810152 -1.972338 -2.425699
H  4.95912 -2.480844 0.541788
H  5.730216 -1.511594 -0.742916
H  5.365589 -0.759888 0.846544
H  0.519822 -1.363239 -0.452175
H  0.799091 0.351978 0.041036
H  0.006231 -0.196512 2.367894
H  -0.262347 -1.891897 1.89351
H  4.382352 1.256269 -2.781398
H  5.560099 0.688441 -1.687473
H  -1.372209 1.659998 1.215626
H  -2.307406 -2.554372 0.736472
H  -3.662288 2.263024 0.336115
H  -4.59652 -1.940661 -0.141833
H  2.736449 2.895353 0.944773
