program: Gaussian 09
title: 000294572
version: EM64L-G09RevD.01
frameworkgroup: C1[X(C11H21NO3)]
method: RPBEPBE
basis: SDD
operation: Freq
keyword: #p
keyword: freq=noraman
keyword: PBEPBE/SDD
title: #p freq=noraman PBEPBE/SDD
converged: YES YES NO NO
title: Mulliken charges:
elementType: O O O N C C C C C C C C C C C H H H H H H H H H H H H H H H H H H H H H
charge: -0.273066 -0.266319 -0.242418 -0.099507 -0.345265 -0.366112 -0.069563 0.013100 -0.364636 -0.164957 -0.716617 -0.724214 -0.710356 0.216932 -0.504083 0.202909 0.199494 0.212748 0.181082 0.211732 0.199103 0.197666 0.225946 0.240638 0.232853 0.212486 0.234180 0.236742 0.222287 0.200647 0.216610 0.229632 0.244039 0.232978 0.241237 0.242070
chargesum: 0.00000
title: Mulliken charges with hydrogens summed into heavy atoms:
elementType: O O O N C C C C C C C C C C C
charge: -0.273066 -0.266319 -0.242418 -0.099507 0.057138 0.027718 0.142169 0.212203 0.058977 0.075681 -0.037099 -0.064538 -0.020075 0.216932 0.212203
polarizability: 1.62862836e+02 4.79374275e+00 1.29532124e+02 -5.07509550e+00 -3.00226930e+00 1.14611559e+02
1716.lowfreq: -20.7803 -3.3950 -0.0008 -0.0007 -0.0004 6.1904 11.9304 28.1543 46.5653
frequency: 9.6246 25.8559 46.5406 68.6906 94.9698 111.8562 142.1940 154.5021 191.3316 198.4969 202.7970 205.1112 207.2126 222.3107 267.0531 296.6944 305.9363 331.8955 358.0744 376.2072 389.6994 459.5371 473.2168 501.6930 513.4139 646.0664 679.3318 715.0351 758.5371 798.3277 819.6835 853.6130 866.1947 903.0680 906.4575 923.7741 941.1205 951.1650 959.3099 1018.5886 1049.6009 1058.5155 1088.8449 1091.4740 1102.9376 1112.7940 1116.1215 1126.7617 1138.5407 1147.5622 1149.9456 1159.9285 1179.8347 1223.5484 1265.0085 1281.0947 1299.1307 1308.7850 1315.4389 1331.6540 1334.6078 1341.0648 1351.3407 1354.7560 1374.7732 1376.4677 1388.6601 1392.1385 1420.9763 1446.0854 1452.0767 1456.0130 1460.8869 1464.5110 1464.6244 1468.9421 1475.7365 1477.8395 1479.6628 1483.3775 1641.7510 2853.1814 2860.9805 2872.5358 2964.7509 2986.2012 2987.8374 2989.6947 3004.5861 3028.3758 3028.8473 3032.4806 3041.9296 3047.7110 3079.8770 3087.4747 3088.5104 3097.9531 3098.0746 3099.8610 3106.3118 3148.8701
redmass: 5.0236 3.6180 3.8292 3.2072 1.0942 3.4091 2.7261 2.4486 1.7952 2.3839 1.3317 1.4318 1.6528 1.5936 2.6628 3.8944 3.0909 2.5340 2.9103 2.3562 2.8034 3.2230 3.1705 2.6803 3.1816 3.4083 3.7342 5.7832 3.5255 3.2979 3.1761 2.3110 3.2691 1.7215 1.6306 1.7831 1.7866 3.4195 1.8094 2.0786 2.0993 2.1689 2.0342 2.2853 2.0111 1.3767 2.6074 2.2707 2.0734 1.4752 2.1666 2.2107 2.9080 1.2294 1.3927 1.3114 1.4272 1.3384 1.5421 1.1732 1.4814 1.2775 1.4643 1.3291 1.2602 1.2285 1.3087 1.3474 1.1886 1.0790 1.0504 1.0807 1.0529 1.0506 1.0545 1.0684 1.0715 1.0577 1.0507 1.0526 8.6418 1.0695 1.0710 1.0692 1.0829 1.0368 1.0346 1.0359 1.0294 1.0872 1.0870 1.0886 1.0883 1.0877 1.0976 1.0994 1.0999 1.0997 1.1002 1.1007 1.1045 1.1049
irintensity: 1.8278 0.4730 1.0641 0.1949 0.2525 0.9604 0.9304 2.8417 5.0900 2.5631 3.0961 1.1574 3.7120 1.0196 4.6109 6.6604 5.6763 5.7745 3.0476 9.2108 1.3556 3.0551 2.9589 6.0503 1.6801 1.9018 3.6040 0.5683 10.3935 23.1878 1.7585 9.1285 5.9188 0.6577 7.3236 3.0916 7.9641 6.8358 4.2324 58.2668 110.0751 50.2964 98.4238 1.6217 5.8386 15.3263 183.2513 7.8651 6.4524 16.7385 1.4499 32.8478 34.8613 28.6507 4.1786 6.2503 7.2181 29.1241 9.1080 9.5127 20.3716 5.2779 16.2859 13.3679 40.3474 16.2483 35.6407 9.7669 19.7691 0.4478 14.8729 6.4029 11.1148 15.4540 9.1734 3.3763 17.5621 2.4700 8.4915 18.0722 150.0555 50.4734 27.7442 175.7153 39.8349 20.2027 32.0715 25.0338 34.3697 13.0210 22.9131 25.8353 20.6643 29.1280 34.7187 31.7740 33.8828 27.5547 27.0145 23.0654 26.7280 16.3201
temp: 298.150 k
press: 1.00000 atm
elementType: 8 8 8 7 6 6 6 6 6 6 6 6 6 6 6 1 1 1 1 1 1 1 1 1 1 1 1 1 1 1 1 1 1 1 1 1
symmnumber: 1
zpe: 813789.9 jmol-1
zpe.correction: 0.309956 hartree
zpe.thermalcorrener: 0.327519 hartree
zpe.thermalcorrenthalpy: 0.328463 hartree
zpe.thermalcorrgfe: 0.262594 hartree
zpe.sumelectzpe: -710.948314 hartree
zpe.sumelectthermal: -710.930751 hartree
zpe.sumelectthermalent: -710.929807 hartree
zpe.sumelectthermalfe: -710.995675 hartree
dipole: 1.0870 0.9929 -0.5944
dipole: 1.5877
quadrupole: -93.2500 -91.9833 -91.5059
quadrupole: 8.8286 -8.6957 0.9372
quadrupole: -1.0036 0.2631 0.7405 8.8286 -8.6957 0.9372
hfenergy: -711.2582698 hartree
pointgroup: C01 [X(C11H21N1O3)]
dipole: -0.4105517 0.1270865 0.4532776 debye
polarizability: 162.3334675|-0.2727223|119.4394134|-8.1859301|7.7014421|125.2336379 unknown
InChI: InChI=1S/C11H21NO3/c1-8(11(13)14-4)5-12-6-9(2)15-10(3)7-12/h8-10H,5-7H2,1-4H3
charge 0 multiplicity 1
36 atoms
O  3.529233 -0.216236 0.637395
O  -3.718513 0.095694 1.018387
O  -3.614447 -0.725955 -1.158508
N  0.749101 -0.267341 -0.136258
C  1.14483 0.014925 1.265872
C  1.729598 -1.189426 -0.76367
C  2.546164 0.664089 1.316825
C  3.136759 -0.558835 -0.750142
C  -0.650747 -0.724382 -0.266094
C  -1.665071 0.461275 -0.199121
C  2.570583 2.101636 0.762433
C  4.22022 -1.504256 -1.270133
C  -1.469114 1.427995 -1.389628
C  -3.074092 -0.115449 -0.20694
C  -5.094857 -0.45131 1.121872
H  1.162008 -0.92596 1.872511
H  0.41087 0.700748 1.726633
H  1.424206 -1.378418 -1.809743
H  1.774083 -2.173546 -0.229515
H  2.899674 0.666071 2.364404
H  3.108902 0.369685 -1.359484
H  -0.912533 -1.479828 0.516674
H  -0.770866 -1.218668 -1.248076
H  -1.531753 1.002874 0.753721
H  2.081024 2.160161 -0.2246
H  2.035066 2.783143 1.449754
H  3.61311 2.453385 0.672937
H  5.206551 -1.012476 -1.220011
H  4.261948 -2.420099 -0.654071
H  4.022564 -1.78942 -2.319641
H  -2.082905 2.339313 -1.27573
H  -1.753584 0.934208 -2.33598
H  -0.405363 1.715921 -1.442864
H  -5.42189 -0.198323 2.140025
H  -5.085302 -1.543088 0.964993
H  -5.74806 0.015392 0.365569
