program: Gaussian 09
title: 000294551
version: EM64L-G09RevD.01
frameworkgroup: C1[X(C7H16O2)]
method: RPBEPBE
basis: SDD
operation: Freq
keyword: #pfreq=noraman
keyword: PBEPBE/SDD
title: #p freq=noraman PBEPBE/SDD
converged: YES YES NO NO
title: Mulliken charges:
elementType: O O C C C C C C C H H H H H H H H H H H H H H H H
charge: -0.284839 -0.443836 -0.049707 -0.435086 -0.379924 -0.258000 -0.685734 -0.198686 -0.680196 0.235797 0.186043 0.213455 0.203493 0.182552 0.190931 0.206037 0.231401 0.212680 0.210534 0.315708 0.181725 0.191100 0.200877 0.227750 0.225922
chargesum: 0.00000
title: Mulliken charges with hydrogens summed into heavy atoms:
elementType: O O C C C C C C C
charge: -0.284839 -0.128128 0.186091 -0.035588 0.006121 0.138969 -0.031118 0.174140 -0.025647
polarizability: 9.82836363e+01 -2.05696483e+00 8.10067819e+01 -1.45837170e+00 7.22063924e-02 7.40459187e+01
1716.lowfreq: -23.4150 -11.0100 -7.9100 -0.0001 0.0005 0.0006 41.6726 54.6372 55.1532
frequency: 41.6140 54.5461 55.0954 103.9498 132.5519 179.9830 194.9586 214.5266 236.1858 268.2303 308.3733 335.4406 411.9574 441.9859 475.7357 527.1789 754.5732 769.0824 814.4297 818.9509 908.5485 920.8174 937.7093 1005.4556 1025.2692 1051.5975 1061.4689 1078.1217 1104.8540 1119.9056 1123.4196 1141.7972 1179.8644 1212.4232 1232.3434 1248.6397 1279.6656 1316.3231 1336.6267 1340.7082 1357.4163 1377.1253 1386.6484 1389.8829 1402.1896 1435.0729 1459.0895 1460.9717 1471.5823 1472.0209 1481.6739 1488.6275 1494.8693 2913.2976 2927.6081 2950.0697 2962.0236 2971.3116 2982.4393 2985.3274 2992.5447 3013.7487 3038.3417 3063.1079 3076.4713 3088.1148 3090.2521 3099.2911 3527.7038
redmass: 3.3907 2.4632 2.1385 2.2582 3.9120 2.0166 2.5714 1.2833 1.1838 3.0648 1.0825 2.8477 2.6020 2.3492 2.5258 2.8252 2.0464 1.5617 1.1160 1.9525 1.7795 2.1769 2.4398 2.2826 1.7873 1.6112 2.4156 3.4965 2.0697 2.0456 2.0551 1.5758 1.3490 1.2471 1.3018 1.1515 1.1684 1.3207 1.3414 1.3270 1.6204 1.1802 1.2347 1.2143 1.4268 1.0957 1.0414 1.0787 1.0743 1.0468 1.0506 1.0568 1.0803 1.0556 1.0567 1.0636 1.1059 1.0660 1.0363 1.1011 1.0357 1.0948 1.0946 1.0910 1.0991 1.0998 1.0990 1.1009 1.0656
irintensity: 1.7192 1.6480 3.0824 1.0255 3.6467 0.8934 3.0651 2.3149 1.0998 1.7961 145.6921 0.1217 8.0565 11.0919 10.6910 7.9764 1.9323 6.3443 4.9448 5.9068 2.4547 54.2000 28.8328 26.3925 2.6829 40.4834 67.9071 72.0892 7.6757 3.2152 38.8694 9.6963 0.8249 11.0075 4.1260 0.1592 4.2799 6.4302 18.4721 15.2854 2.2950 21.1016 18.3978 12.9627 9.2667 7.7725 10.6200 8.4582 17.1923 9.0047 0.6265 14.1282 5.5891 39.6446 112.0776 29.3822 66.5852 37.9595 35.1444 49.1408 23.6933 16.6319 26.5380 21.9921 63.3081 35.6213 39.5362 39.7885 2.9037
temp: 298.150 k
press: 1.00000 atm
elementType: 8 8 6 6 6 6 6 6 6 1 1 1 1 1 1 1 1 1 1 1 1 1 1 1 1
symmnumber: 1
zpe: 580928.9 jmol-1
zpe.correction: 0.221264 hartree
zpe.thermalcorrener: 0.233384 hartree
zpe.thermalcorrenthalpy: 0.234328 hartree
zpe.thermalcorrgfe: 0.182371 hartree
zpe.sumelectzpe: -425.992748 hartree
zpe.sumelectthermal: -425.980629 hartree
zpe.sumelectthermalent: -425.979684 hartree
zpe.sumelectthermalfe: -426.031642 hartree
dipole: 0.0093 -1.7395 -0.7336
dipole: 1.8879
quadrupole: -50.7979 -53.6826 -60.9684
quadrupole: -2.1203 -3.4436 -0.6966
quadrupole: 4.3517 1.4671 -5.8188 -2.1203 -3.4436 -0.6966
hfenergy: -426.2140125 hartree
pointgroup: C01 [X(C7H16O2)]
dipole: 0.0018815 0.7223494 0.1728853 debye
dipolederiv: -1.0558712 -0.3214305 -0.0465765 -0.3468183 -0.6156442 -0.0379919 -0.0484794 -0.0128097 -0.4175635 -0.5834768 0.2697147 0.0618903 0.3051052 -0.2714865 0.0923183 0.0834059 0.0747858 -0.7577959 0.4100879 -0.094126 -0.069886 -0.1316773 0.2382693 -0.0818505 -0.1141013 -0.1062567 0.5860285 -0.1170226 0.08612 -0.0009697 0.1065384 0.0328315 -0.0759842 -0.0383368 -0.0046068 0.0125329 -0.0375893 0.08739 -0.0800835 0.0876526 0.1237613 -0.023886 0.0000744 -0.0106707 0.0230547 0.4948456 0.1515254 -0.0761301 0.3034331 0.5664988 0.0345263 -0.1175764 -0.0478871 0.3132438 -0.013512 0.0731826 0.0221835 0.0618729 0.005773 -0.0386218 -0.0122869 -0.0106281 0.0317794 0.836607 0.1387177 0.0640533 0.0545313 0.3631397 0.080363 0.1832126 0.1350441 0.4131369 -0.0351961 -0.086079 0.0250131 -0.0978142 -0.0714323 0.0388826 0.0164001 0.0371666 0.0472633 0.0739963 -0.0685568 0.0047681 -0.0825157 -0.0701784 0.0101963 -0.0130908 -0.0013125 0.0076085 -0.05446 -0.1357717 0.0175082 -0.088375 -0.1217667 0.0079339 0.0334733 0.0530154 0.0808257 0.0731829 0.0128224 0.0220725 0.0362229 0.0832053 0.0449385 0.0005218 0.0114332 -0.1516147 0.0549513 0.0192853 0.0606552 0.020301 0.0599562 0.0214961 0.0473722 0.0013057 -0.1816332 -0.0181331 -0.0674067 -0.0116433 -0.1067322 -0.1806271 0.009372 0.0264993 0.0418107 0.0676369 -0.114317 0.1363957 0.0413681 0.0307529 -0.2088179 -0.0377116 0.0607408 -0.0633182 0.0372093 0.0645184 -0.0375151 -0.0159501 -0.0877593 0.0054935 -0.0200279 0.0094015 0.0708107 -0.1698916 0.1132586 -0.0093123 0.0265629 -0.0130192 0.0842121 0.0317814 0.0781905 -0.0193263 -0.1271469 0.0249078 -0.1290232 0.0354964 -0.0677826 -0.1185135 0.0244211 0.0343514 0.0366607 0.0816876 -0.1810034 0.0605089 -0.0966272 0.038941 0.0643993 -0.0062634 -0.1154075 0.0079164 0.0491474 0.2511792 -0.1803299 0.0047959 -0.2066994 0.0841821 -0.0076472 -0.053483 -0.0830621 0.2735095 -0.1472113 0.0572844 -0.0066345 0.1686295 -0.1650602 -0.0194691 -0.004019 -0.06105 0.0347795 -0.0358453 -0.0412083 0.0607836 -0.0150534 0.0351577 0.0071237 -0.0543402 -0.0227282 -0.237973 -0.1457982 -0.0683035 -0.0926429 -0.0526069 0.0733996 0.0006747 -0.1120799 -0.0134694 0.0526896 0.0319244 0.1409232 0.0301898 0.0881961 -0.072798 -0.0244633 0.0465152 -0.0262372 0.0828387 0.1099768 0.0051929 0.0198026 -0.0053234 0.0760455 -0.0301112 0.0630422 0.0134136 -0.1513532 unknown
polarizability: 98.2844587|2.391442|80.8849929|0.4797889|-1.1077294|74.1668852 unknown
InChI: InChI=1S/C7H16O2/c1-3-7(8)5-6-9-4-2/h7-8H,3-6H2,1-2H3
charge 0 multiplicity 1
25 atoms
O  -1.687434 0.09625 0.401289
O  1.48619 0.352233 -1.539548
C  1.292621 0.10785 -0.085857
C  0.437453 1.232886 0.536337
C  2.647462 -0.080036 0.628271
C  -0.970087 1.293077 -0.064381
C  3.456242 -1.274144 0.080557
C  -2.993919 -0.065391 -0.249326
C  -3.635022 -1.335762 0.309375
H  0.715241 -0.832829 -0.066069
H  0.945315 2.209491 0.390422
H  0.345394 1.069857 1.627588
H  2.459251 -0.217211 1.711963
H  3.237816 0.85749 0.531364
H  -1.508971 2.208049 0.268832
H  -0.908677 1.295409 -1.174343
H  3.582388 -1.186276 -1.012971
H  2.932404 -2.227447 0.279623
H  4.456935 -1.331831 0.546322
H  2.054057 1.160721 -1.638265
H  -3.631909 0.824389 -0.044133
H  -2.856232 -0.139164 -1.351371
H  -4.624039 -1.507031 -0.153767
H  -2.995111 -2.211335 0.104067
H  -3.767565 -1.253244 1.402022
