program: Gaussian 09
title: 000294546
version: EM64L-G09RevD.01
frameworkgroup: C1[X(C8H18S2)]
method: RPBEPBE
basis: SDD
operation: Freq
keyword: #pfreq=noraman
keyword: PBEPBE/SDD
title: #p freq=noraman PBEPBE/SDD
converged: NO NO NO NO
title: Mulliken charges:
elementType: S S C C C C C C C C H H H H H H H H H H H H H H H H H H
charge: 0.145629 0.145630 -0.605487 -0.605485 -0.614139 -0.614137 -0.340117 -0.340118 -0.669797 -0.669796 0.259986 0.259918 0.259966 0.259938 0.244467 0.244667 0.244659 0.244475 0.216382 0.216221 0.216220 0.216384 0.209999 0.222241 0.210028 0.210030 0.222241 0.209996
chargesum: 0.00000
title: Mulliken charges with hydrogens summed into heavy atoms:
elementType: S S C C C C C C C C
charge: 0.145629 0.145630 -0.085583 -0.085582 -0.125004 -0.125004 0.092486 0.092485 -0.027529 -0.027529
polarizability: 1.95656983e+02 -1.73998206e+00 1.04748096e+02 -3.40366287e-02 -2.87037658e-03 8.51528937e+01
1716.lowfreq: -13.4839 -3.7732 -2.3648 -0.0043 -0.0031 -0.0004 6.0173 40.2755 40.7818
frequency: 6.0171 40.2755 40.7817 42.0839 54.0905 90.3183 92.2565 102.6789 102.8375 182.8027 206.9395 227.0963 227.1680 278.7325 312.2751 349.8959 363.4836 663.6499 696.5598 707.2533 751.1916 751.9052 758.7020 783.1344 858.6431 861.4029 899.4500 899.7164 950.5797 1043.1912 1043.5003 1045.6930 1047.0451 1050.1048 1101.3955 1102.3378 1108.8692 1212.5327 1216.1111 1216.4546 1237.4361 1259.9448 1262.9368 1286.1605 1286.3981 1295.3742 1336.0713 1337.8749 1391.5440 1391.5745 1452.1291 1453.2031 1461.9065 1462.8107 1476.0113 1476.0803 1478.5485 1478.5526 1485.9257 1485.9378 2975.4126 2975.4875 2989.7948 2989.9377 2998.3641 2998.4146 3008.8704 3015.6549 3036.4045 3036.4081 3064.9993 3065.2031 3071.9593 3076.7328 3076.7560 3082.2223 3082.3302 3098.0188
redmass: 4.4170 2.3395 2.4139 2.6969 1.7418 4.8503 3.6843 2.4018 2.5324 4.9787 3.4677 1.1029 1.1045 3.5613 4.3823 3.5803 5.5675 9.5595 4.7039 5.0298 1.0798 1.0804 5.5307 1.1102 1.1805 1.1812 1.9655 1.9492 1.3027 3.1727 1.1529 1.1676 2.8042 3.3882 2.1078 1.0473 2.2521 1.1684 1.4180 1.4168 1.2144 1.2241 1.1838 1.1035 1.1042 1.2670 1.4375 1.4276 1.2069 1.2068 1.0861 1.0879 1.0870 1.0930 1.0510 1.0509 1.0418 1.0418 1.0810 1.0811 1.0353 1.0353 1.0591 1.0593 1.0564 1.0564 1.0567 1.0548 1.1017 1.1017 1.1054 1.1051 1.1074 1.0993 1.0993 1.1049 1.1051 1.1104
irintensity: 1.8187 0.8385 0.8532 0.0002 0.0000 0.0029 3.9359 2.2178 0.0004 0.0000 4.2245 0.0000 0.0002 0.0000 0.9067 1.1081 0.0000 11.9128 0.0000 15.5318 15.7141 0.0000 0.0000 15.1701 0.0000 0.0182 0.0002 19.0519 0.0000 0.0009 2.2758 0.0000 3.5880 0.0000 31.7757 0.8001 0.0000 21.1716 0.0002 0.1099 0.0000 17.0113 0.0000 0.1860 0.0000 0.0000 10.9379 0.0000 25.3999 0.0890 0.0000 14.6451 0.0000 7.2802 6.3152 0.0026 0.5516 26.6267 0.3147 25.5346 74.3735 0.0015 9.4893 0.0000 110.5384 0.0589 0.0000 27.6379 0.2081 0.0197 0.0000 0.0658 0.0000 95.4690 0.4902 203.1255 0.0002 23.1932
temp: 298.150 k
press: 1.00000 atm
elementType: 16 16 6 6 6 6 6 6 6 6 1 1 1 1 1 1 1 1 1 1 1 1 1 1 1 1 1 1
symmnumber: 1
zpe: 639574.7 jmol-1
zpe.correction: 0.243601 hartree
zpe.thermalcorrener: 0.258884 hartree
zpe.thermalcorrenthalpy: 0.259828 hartree
zpe.thermalcorrgfe: 0.196358 hartree
zpe.sumelectzpe: -1110.912407 hartree
zpe.sumelectthermal: -1110.897124 hartree
zpe.sumelectthermalent: -1110.896180 hartree
zpe.sumelectthermalfe: -1110.959650 hartree
dipole: 0.0000 0.0000 0.0021
dipole: 0.0021
quadrupole: -65.6896 -82.0134 -80.3343
quadrupole: -6.8823 0.0054 0.0035
quadrupole: 10.3229 -6.0010 -4.3219 -6.8823 0.0054 0.0035
hfenergy: -1111.1560079 hartree
pointgroup: C01 [X(C8H18S2)]
dipole: -0.0000011 -0.0000162 -0.0008154 debye
polarizability: 195.6850312|0.6741994|104.7109046|0.1716156|-0.4158392|85.1620371 unknown
InChI: InChI=1S/C8H18S2/c1-3-5-9-7-8-10-6-4-2/h3-8H2,1-2H3
charge 0 multiplicity 1
28 atoms
S  -2.079368 0.89861 -0.023514
S  2.078998 -0.898393 0.024955
C  -0.669916 -0.372962 0.007463
C  0.669544 0.373172 -0.006166
C  -3.540226 -0.311937 -0.001726
C  3.539855 0.312113 0.000907
C  -4.866865 0.47106 -0.012623
C  4.866493 -0.470887 0.011601
C  -6.087893 -0.477179 0.000416
C  6.087521 0.477336 -0.002722
H  -0.773126 -0.982043 0.922407
H  -0.769144 -1.021823 -0.880148
H  0.772778 0.982132 -0.921189
H  0.768748 1.022152 0.881361
H  -3.456154 -0.933108 0.908657
H  -3.458778 -0.962513 -0.89157
H  3.459086 0.96356 0.890175
H  3.455103 0.932396 -0.91002
H  -4.902986 1.141825 0.867273
H  -4.903086 1.116948 -0.910978
H  4.903204 -1.116155 0.910382
H  4.90213 -1.142256 -0.867853
H  -6.087395 -1.1163 0.903394
H  -7.031886 0.097555 -0.007521
H  -6.087243 -1.14074 -0.884747
H  6.087371 1.141427 0.882042
H  7.031515 -0.0974 0.005026
H  6.086521 1.115916 -0.906084
