program: Gaussian 09
title: 000294600
version: EM64L-G09RevD.01
frameworkgroup: C1[X(C20H24N6)]
method: RPBEPBE
basis: SDD
operation: Freq
keyword: #pfreq=noraman
keyword: PBEPBE/SDD
title: #p freq=noraman PBEPBE/SDD
converged: YES YES NO NO
title: Mulliken charges:
elementType: N N N N N N C C C C C C C C C C C C C C C C C C C C H H H H H H H H H H H H H H H H H H H H H H H H
charge: -0.077618 -0.044330 -0.146531 -0.053410 -0.059140 -0.644176 -0.359671 -0.348210 -0.343398 -0.365659 -0.670380 -0.676222 0.227813 0.051494 -0.141273 0.226272 0.064709 0.113058 -0.354101 -0.331286 -0.334234 -0.347559 -0.258656 -0.220275 -0.266677 -0.214962 0.211433 0.230836 0.195363 0.244692 0.205371 0.198910 0.184906 0.279804 0.231760 0.210562 0.214474 0.202698 0.211553 0.223223 0.258245 0.249747 0.199759 0.263527 0.224744 0.221264 0.228234 0.231633 0.317590 0.334095
chargesum: 0.00000
title: Mulliken charges with hydrogens summed into heavy atoms:
elementType: N N N N N N C C C C C C C C C C C C C C C C C C C C
charge: -0.077618 -0.044330 -0.146531 -0.053410 -0.059140 0.007509 0.082599 0.091844 0.060883 0.099052 -0.013584 -0.038747 0.227813 0.051494 -0.141273 0.226272 0.064709 0.113058 -0.095857 -0.081539 -0.134475 -0.084033 -0.033912 0.000990 -0.038444 0.016671
polarizability: 3.91898994e+02 1.09652511e+01 3.30781366e+02 3.09157632e+01 -1.63554955e+01 1.67224342e+02
1716.lowfreq: -10.1143 -6.1819 -0.0007 -0.0007 -0.0001 5.6907 9.7409 23.3044 31.5817
frequency: 7.0833 23.1594 31.4947 43.7991 49.7763 51.2269 70.5026 85.3049 96.3839 104.2960 130.5200 131.5421 168.4286 183.8084 203.5766 222.4468 226.0358 240.5042 247.2780 265.6611 271.2543 290.3858 301.3663 330.0008 345.4177 368.5969 398.0319 406.3580 427.3816 454.3286 462.5733 492.4328 500.6439 516.4395 528.8843 541.4026 546.3411 567.5186 575.5200 594.4809 625.0617 669.1752 671.0716 707.4685 724.4325 742.9657 763.6787 765.2599 769.4752 771.1585 806.8522 817.4230 847.8497 852.3374 862.1608 872.2181 876.6425 885.1421 887.2161 898.6664 928.5310 950.4468 956.3719 982.1781 987.0876 994.0736 1020.6233 1030.9811 1043.6832 1049.0177 1068.3806 1086.3422 1093.2273 1096.1453 1104.8076 1107.7667 1129.4158 1155.9984 1167.3863 1173.7818 1188.9690 1200.8490 1226.1308 1244.0526 1261.7223 1262.5450 1276.7967 1280.6168 1303.3843 1307.7630 1311.8197 1330.0966 1338.7781 1348.2490 1352.2952 1359.4942 1372.0244 1382.6981 1385.4162 1388.3563 1396.0147 1426.3929 1431.8653 1440.8992 1443.7241 1455.9790 1462.0011 1474.0196 1477.7785 1479.1446 1480.9885 1484.1497 1485.9320 1499.6306 1511.9193 1558.6893 1577.1121 1598.8787 1616.1893 1621.2184 2972.1174 2972.4082 2979.9999 2982.8789 2985.0576 2996.3490 3026.0343 3045.2637 3060.1760 3069.1226 3074.2762 3079.3168 3081.0535 3085.4757 3112.7125 3123.7700 3135.2727 3143.0079 3155.5434 3157.5599 3167.7377 3171.8424 3546.6600 3704.6104
redmass: 4.1244 4.6389 3.4246 4.6624 3.4033 3.4259 5.1177 3.0835 3.8657 1.6599 2.2698 4.0293 5.2665 3.8015 1.8848 2.0186 2.9150 2.3580 2.1866 3.1041 3.1876 4.1506 4.0223 3.8022 3.7113 1.3337 3.8119 2.4093 2.3150 3.7683 4.3165 4.4342 6.1760 6.6182 3.7085 2.6407 1.3346 3.8116 5.7283 4.7013 5.0152 4.0969 5.2866 4.4943 4.7706 1.2096 1.6894 1.5858 1.7253 2.1886 3.3110 2.2883 2.7148 2.3972 2.0448 1.7446 1.5781 2.5110 2.9295 1.6546 2.9080 1.3820 1.3979 1.3349 2.9357 1.3300 2.3000 1.6966 2.0144 3.0033 2.6432 2.6107 2.0959 1.9900 2.1834 2.0894 1.8077 1.6575 1.0765 1.2199 2.4666 2.1821 1.7978 1.8815 1.4334 1.3070 2.7810 1.3006 1.6816 2.7612 2.2034 1.8027 1.7691 1.8169 2.1195 1.6972 1.9236 4.0254 4.6779 1.2544 1.2444 2.5648 3.1116 1.2227 2.5888 1.1149 1.0807 1.1624 2.1623 1.0859 1.0460 1.0595 1.1004 3.2996 6.0803 6.2787 7.1200 5.9659 1.3894 6.4726 1.0504 1.0460 1.0625 1.0449 1.0561 1.0589 1.1004 1.0960 1.1024 1.0984 1.0987 1.0998 1.1029 1.1000 1.0872 1.0855 1.0885 1.0898 1.0949 1.0939 1.0994 1.0987 1.0454 1.1034
irintensity: 0.0788 0.0777 0.0359 0.7834 0.2883 1.0636 0.7298 0.8526 3.3888 0.1491 0.6813 7.0522 0.1385 0.0887 0.1458 0.3642 2.2865 0.9932 3.0614 0.7725 0.9291 1.7654 0.4847 0.8169 0.3299 86.4167 2.4810 7.0887 68.1120 0.4805 10.1331 5.7027 6.2738 0.4453 14.5435 0.4971 91.1299 4.8209 11.2123 2.9334 3.7412 40.9363 11.2306 14.2752 5.7066 15.4112 61.5660 87.8422 7.7801 10.3715 0.9735 11.7337 0.4628 13.8779 2.1722 3.2894 1.4894 2.3736 14.3267 5.9824 2.2163 1.6134 2.8683 0.4211 20.7999 0.4055 6.0166 11.8293 6.7124 3.4425 159.5877 6.2173 3.8820 41.5267 10.9977 14.0750 0.2216 5.6795 5.9828 0.7118 14.4598 13.4736 8.0909 3.6923 4.3602 2.1824 3.4971 0.7918 14.7186 48.4760 4.0189 186.1323 109.7272 47.7649 85.7209 3.6914 117.9775 21.0039 57.7182 13.8005 21.2458 39.9022 98.2170 36.1184 20.8508 16.3016 3.4041 29.9932 42.9784 8.8764 10.8969 11.6493 13.3035 145.3314 196.6290 41.0398 17.9526 27.0566 298.3255 35.8931 8.7683 44.2582 7.4396 77.8429 49.2551 57.8706 36.3501 10.4183 3.4111 10.9480 31.8654 48.0311 60.4704 63.8740 10.8467 4.8692 12.2016 17.2368 28.6920 14.5526 31.4828 21.4477 63.8586 28.7064
temp: 298.150 k
press: 1.00000 atm
elementType: 7 7 7 7 7 7 6 6 6 6 6 6 6 6 6 6 6 6 6 6 6 6 6 6 6 6 1 1 1 1 1 1 1 1 1 1 1 1 1 1 1 1 1 1 1 1 1 1 1 1
symmnumber: 1
zpe: 1072556.9 jmol-1
zpe.correction: 0.408515 hartree
zpe.thermalcorrener: 0.433408 hartree
zpe.thermalcorrenthalpy: 0.434352 hartree
zpe.thermalcorrgfe: 0.350988 hartree
zpe.sumelectzpe: -1103.125988 hartree
zpe.sumelectthermal: -1103.101096 hartree
zpe.sumelectthermalent: -1103.100151 hartree
zpe.sumelectthermalfe: -1103.183516 hartree
dipole: 0.2215 -5.3365 1.2928
dipole: 5.4953
quadrupole: -124.2780 -138.7999 -152.9012
quadrupole: 3.7872 -1.6874 -6.8683
quadrupole: 14.3817 -0.1402 -14.2415 3.7872 -1.6874 -6.8683
hfenergy: -1103.5345034 hartree
pointgroup: C01 [X(C20H24N6)]
dipole: -0.4793752 2.0074726 -0.6438893 debye
polarizability: 390.0276669|1.4140537|324.6270065|-37.5594788|-36.1239968|175.2500287 unknown
InChI: InChI=1S/C20H24N6/c1-3-13-26(14-4-2)25-24-18-12-8-6-10-16(18)20-22-17-11-7-5-9-15(17)19(21)23-20/h5-12H,3-4,13-14,21H2,1-2H3
charge 0 multiplicity 1
50 atoms
N  2.757111 1.998854 -0.351623
N  2.663102 0.652798 -0.558774
N  1.578567 0.110432 -0.042348
N  -1.957533 -1.726366 0.832746
N  -1.174545 -0.262659 -0.952958
N  -2.524017 1.317037 -1.987081
C  3.920432 2.659902 -0.965824
C  1.737524 2.767428 0.395278
C  5.023344 3.049792 0.051113
C  0.492919 3.107132 -0.461321
C  5.672246 1.831722 0.739986
C  -0.554585 3.894418 0.353565
C  0.304616 -1.983971 -0.004554
C  1.562812 -1.315487 -0.128938
C  -1.004739 -1.271628 -0.017755
C  -3.473342 -0.006818 -0.122044
C  -3.19264 -1.090919 0.789787
C  -2.381948 0.347407 -1.01612
C  0.283568 -3.397643 0.112866
C  2.756197 -2.091573 -0.194939
C  -4.756309 0.617026 -0.103962
C  -4.21993 -1.521728 1.687659
C  1.468653 -4.156782 0.049618
C  2.709908 -3.495502 -0.119015
C  -5.743976 0.179371 0.787323
C  -5.471613 -0.898641 1.685023
H  3.571588 3.562994 -1.505465
H  4.327314 1.952852 -1.709691
H  2.219944 3.690727 0.767718
H  1.419998 2.156423 1.260675
H  5.79251 3.632596 -0.494191
H  4.598241 3.732232 0.814253
H  0.805698 3.693572 -1.348752
H  0.061823 2.154597 -0.816157
H  4.917106 1.230715 1.277178
H  6.160843 1.170789 0.000225
H  6.437536 2.151461 1.470303
H  -0.144787 4.85178 0.729292
H  -1.442975 4.124494 -0.262374
H  -0.896781 3.30575 1.225042
H  -0.68777 -3.883863 0.246585
H  3.711924 -1.564256 -0.278282
H  -4.984378 1.451547 -0.778765
H  -3.983017 -2.344592 2.36891
H  1.428315 -5.248153 0.133652
H  3.639341 -4.074921 -0.168415
H  -6.726538 0.663257 0.800373
H  -6.25151 -1.233694 2.377778
H  -3.4051 1.788524 -2.16408
H  -1.724348 1.489264 -2.59412
