program: Gaussian 09
title: 000027306
version: EM64L-G09RevD.01
frameworkgroup: C1[X(C9H12ClN5)]
method: RPBEPBE
basis: SDD
operation: Freq
keyword: #p
keyword: freq=noraman
keyword: PBEPBE/SDD
title: #p freq=noraman PBEPBE/SDD
converged: YES YES NO NO
title: Mulliken charges:
elementType: Cl N N N N N C C C C C C C C C H H H H H H H H H H H H
charge: -0.015752 -0.327672 -0.327739 -0.148449 -0.023839 -0.023826 -0.435302 -0.435146 0.126173 0.126204 -0.036760 -0.037118 -0.287251 -0.568933 -0.568749 0.257744 0.221931 0.257703 0.221928 0.332301 0.332360 0.238962 0.238936 0.223169 0.217955 0.223173 0.217999
chargesum: 0.00000
title: Mulliken charges with hydrogens summed into heavy atoms:
elementType: Cl N N N N N C C C C C C C C C
charge: -0.015752 0.004629 0.004621 -0.148449 -0.023839 -0.023826 0.044373 0.044485 0.126173 0.126204 0.202202 0.201818 -0.287251 -0.127810 -0.127577
polarizability: 2.05357408e+02 3.11332561e-02 1.81733624e+02 -1.14760539e+01 1.66631402e-02 8.41153989e+01
1716.lowfreq: -6.8815 -1.8328 0.0010 0.0020 0.0026 3.2442 27.4984 30.1451 45.1596
frequency: 27.3745 30.1429 45.1379 65.1556 82.4080 89.7506 143.8390 165.8903 174.8217 184.3873 201.4091 239.0801 307.3466 339.1852 346.5374 404.0310 407.8449 502.7899 518.8283 612.3423 615.1033 627.0562 632.7664 652.7138 668.7809 670.0161 701.9168 788.0106 833.6234 888.3771 895.3196 917.5692 938.3964 954.8002 958.2718 967.8733 1005.2112 1008.9868 1042.2937 1095.0050 1109.6787 1135.2274 1145.5987 1189.7284 1212.6035 1249.0371 1266.0456 1282.2600 1282.7652 1326.6820 1329.2301 1372.2036 1374.2164 1428.4129 1428.6442 1464.6877 1467.8019 1481.6502 1516.1984 1542.7733 1593.0548 1658.3799 1658.7534 2988.0872 2988.8037 3060.1832 3060.8274 3088.8730 3088.8834 3108.5874 3108.7332 3200.5815 3200.6053 3553.1994 3554.2174
redmass: 3.4160 3.9604 4.6699 5.2836 2.1083 2.5064 3.1999 5.3937 8.9431 6.0186 5.4815 4.6921 6.5867 2.5097 2.7004 4.9170 2.7148 2.3560 2.8617 2.8971 1.7743 4.7539 1.1557 2.5613 2.2901 1.9393 8.2546 11.2149 6.3440 5.5638 1.4868 1.8242 2.5238 1.4094 1.3495 1.7641 1.1345 1.1876 3.1087 3.9152 5.7903 2.0779 2.1214 2.5904 4.2970 1.2403 1.5547 1.2358 1.2319 1.3970 1.3286 2.1691 2.6572 1.1954 1.1989 1.1812 1.0961 1.9248 2.8441 7.3417 6.2132 4.5987 4.5986 1.0630 1.0631 1.0978 1.0976 1.0604 1.0604 1.0951 1.0951 1.1142 1.1142 1.0769 1.0770
irintensity: 0.0614 0.0171 0.0314 0.4930 0.0721 0.4914 0.2576 0.5528 5.6507 0.0090 0.1850 2.2696 17.8561 0.1746 3.0443 5.8601 1.5277 4.1833 12.4314 7.5805 103.5323 6.5107 16.8918 66.4611 31.8145 44.2728 1.0743 36.4435 51.6643 24.4381 31.7286 4.1929 6.8125 105.0031 45.7229 21.3800 0.7155 33.1702 8.2368 148.5966 8.6842 41.5945 10.4677 87.3380 9.0487 124.7583 11.7740 0.6246 0.3897 133.5436 22.0775 12.5863 361.4259 49.7466 4.2495 41.1629 76.5360 133.5857 30.6221 1733.9171 323.3766 26.9555 14.8793 52.0058 41.6621 6.0591 3.9345 5.3007 18.8194 6.8749 11.1917 0.3492 46.2431 146.0432 2.8327
temp: 298.150 k
press: 1.00000 atm
elementType: 17 7 7 7 7 7 6 6 6 6 6 6 6 6 6 1 1 1 1 1 1 1 1 1 1 1 1
symmnumber: 1
zpe: 545901.5 jmol-1
zpe.correction: 0.207923 hartree
zpe.thermalcorrener: 0.223336 hartree
zpe.thermalcorrenthalpy: 0.224280 hartree
zpe.thermalcorrgfe: 0.162329 hartree
zpe.sumelectzpe: -1082.831418 hartree
zpe.sumelectthermal: -1082.816005 hartree
zpe.sumelectthermalent: -1082.815061 hartree
zpe.sumelectthermalfe: -1082.877012 hartree
dipole: 0.0042 -5.3062 0.0033
dipole: 5.3062
quadrupole: -79.2161 -107.3092 -92.2772
quadrupole: 0.0243 -2.3642 0.0073
quadrupole: 13.7181 -14.3750 0.6569 0.0243 -2.3642 0.0073
hfenergy: -1083.0393407 hartree
pointgroup: C01 [X(C9H12Cl1N5)]
dipole: 0.0100562 -2.0875851 -0.0033271 debye
polarizability: 203.1078553|0.1088581|181.7341014|-19.9830586|-0.029623|86.3644744 unknown
InChI: InChI=1S/C9H12ClN5/c1-3-5-11-8-13-7(10)14-9(15-8)12-6-4-2/h3-4,11-12H,1-2,5-6H2
charge 0 multiplicity 1
27 atoms
Cl -0.019552 4.413202 0.006646
N  2.280793 -0.005292 -0.625434
N  -2.276745 -0.029507 0.623862
N  0.002506 -0.114117 -0.00092
N  -1.178257 2.00452 0.317095
N  1.162571 2.017023 -0.311932
C  2.466975 -1.465773 -0.660752
C  -2.448783 -1.491717 0.655173
C  1.112736 0.627257 -0.302472
C  -1.114845 0.615376 0.302904
C  3.567079 -1.914042 0.282953
C  -3.549929 -1.946896 -0.283976
C  -0.010708 2.593085 0.003493
C  4.649949 -2.636392 -0.096945
C  -4.624855 -2.679062 0.099652
H  1.496229 -1.906283 -0.371643
H  2.696191 -1.794894 -1.693075
H  -1.475549 -1.922049 0.35912
H  -2.669031 -1.826882 1.687551
H  3.072598 0.60982 -0.824513
H  -3.074268 0.577439 0.825215
H  3.439268 -1.618574 1.334427
H  -3.430093 -1.6477 -1.335347
H  5.41036 -2.954007 0.624573
H  4.802965 -2.937448 -1.141344
H  -5.386401 -3.000991 -0.618753
H  -4.770004 -2.983994 1.144043
