program: Gaussian 09
title: 000294548
version: EM64L-G09RevD.01
frameworkgroup: C1[X(C12H18N2O2)]
method: RPBEPBE
basis: SDD
operation: Freq
keyword: #p
keyword: freq=noraman
keyword: PBEPBE/SDD
title: #p freq=noraman PBEPBE/SDD
converged: YES YES NO NO
title: Mulliken charges:
elementType: O O N N C C C C C C C C C C C C H H H H H H H H H H H H H H H H H H
charge: -0.206450 -0.245799 -0.233676 -0.246966 0.161196 -0.411351 -0.030508 0.121211 -0.684221 0.241868 -0.703931 -0.692325 0.000584 -0.006090 -0.597453 -0.561486 0.200600 0.232734 0.191567 0.238567 0.251258 0.217874 0.220739 0.231683 0.213917 0.233547 0.213352 0.206426 0.215247 0.255240 0.211080 0.274663 0.212836 0.274065
chargesum: 0.00000
title: Mulliken charges with hydrogens summed into heavy atoms:
elementType: O O N N C C C C C C C C C C C C
charge: -0.206450 -0.245799 -0.233676 -0.246966 0.161196 0.021983 0.161059 0.121211 0.023478 0.241868 -0.037591 -0.039000 0.215831 0.249150 -0.111710 -0.074585
polarizability: 1.67376674e+02 5.70833353e+00 1.62491653e+02 2.04844319e+01 -1.63910049e+01 1.19966710e+02
1716.lowfreq: -18.9257 -0.0011 -0.0008 -0.0007 9.9481 11.4654 22.5485 55.0302 78.3790
frequency: 21.4499 54.9560 78.2693 88.7828 125.8380 154.4090 156.0269 175.7595 180.6915 209.6222 219.2320 236.1128 245.5856 254.7941 257.5357 278.3538 297.6488 355.7372 365.3279 371.8380 409.3392 417.3490 423.1401 518.1517 567.4694 578.5954 613.2045 657.0659 687.5109 694.1884 719.2175 749.8000 773.1233 857.6846 883.2262 900.5511 904.3747 918.1675 934.5850 949.1731 964.8417 971.8984 992.7065 996.6068 1001.9003 1035.8108 1073.6499 1089.5325 1108.7639 1114.0204 1164.9587 1196.7369 1207.4839 1221.6530 1267.9893 1308.8960 1310.7164 1317.3974 1337.9063 1355.1999 1363.2315 1380.3891 1384.7825 1389.4224 1403.2797 1411.7037 1413.2235 1446.7718 1462.0108 1469.0108 1471.5141 1480.2357 1482.2925 1494.0713 1630.6309 1645.5888 1657.9123 1690.3332 2949.0112 2976.4077 2978.3552 2982.7655 2993.7566 3033.2731 3066.6883 3069.9078 3080.5296 3089.2623 3094.7393 3106.0398 3122.7730 3124.0085 3143.8609 3149.4021 3246.8601 3249.0901
redmass: 2.9064 4.0562 3.3756 6.1425 2.6324 3.1300 2.3276 3.3027 2.1642 1.4445 1.8583 3.1760 1.1534 1.1063 2.9270 3.7134 3.4277 4.3527 2.2538 2.2513 3.8259 3.6205 3.9055 4.0221 3.7868 3.6014 4.6044 2.4359 2.1919 2.4138 3.6617 3.9394 3.0705 2.2933 2.5754 1.6984 1.4094 1.3113 1.3863 2.3030 1.4714 1.0942 1.8463 1.7731 1.0885 2.2134 2.4281 2.0974 1.9589 2.9630 2.6867 2.5082 2.6844 3.7413 1.4210 1.7113 1.5811 1.6299 1.4321 1.6955 1.6537 2.0248 1.2070 1.2545 1.2128 1.2131 1.3257 1.0799 1.0460 1.0545 1.0658 1.0498 1.0569 1.0543 6.9034 4.9911 6.4412 9.8484 1.0804 1.0569 1.0358 1.0429 1.0349 1.0998 1.0995 1.0987 1.1001 1.0985 1.1006 1.1007 1.0605 1.0593 1.0922 1.0955 1.1155 1.1153
irintensity: 0.0224 0.3589 0.6312 1.8218 1.7590 1.3841 3.3373 0.9256 1.8893 0.3755 0.2916 1.8392 0.0670 0.2174 1.1297 0.2616 1.4255 10.3214 1.9781 0.6214 1.6410 2.2213 2.6087 15.1976 13.6765 21.0761 6.7827 23.4344 2.1426 1.6135 0.2455 0.9065 2.6008 2.0003 1.1152 7.1896 68.3459 0.1339 68.3099 4.0997 0.7651 41.2145 23.8381 23.0652 46.6722 13.1314 19.5216 6.9567 0.9080 4.2967 17.2922 48.7731 71.6436 4.5401 14.2072 103.7799 45.3573 26.2400 6.6523 143.6283 100.3013 264.5428 10.1647 53.6918 19.1140 0.5243 12.3368 7.0984 3.3964 4.6240 12.1639 39.0738 5.8410 12.0576 130.2046 158.4240 285.6191 73.4654 20.8847 45.7479 31.6888 12.3833 18.2697 13.2377 15.3933 67.1558 22.3952 47.1067 19.9859 13.2235 0.3151 2.1789 15.5862 8.7976 5.8032 5.4132
temp: 298.150 k
press: 1.00000 atm
elementType: 8 8 7 7 6 6 6 6 6 6 6 6 6 6 6 6 1 1 1 1 1 1 1 1 1 1 1 1 1 1 1 1 1 1
symmnumber: 1
zpe: 738429.0 jmol-1
zpe.correction: 0.281253 hartree
zpe.thermalcorrener: 0.298604 hartree
zpe.thermalcorrenthalpy: 0.299548 hartree
zpe.thermalcorrgfe: 0.236787 hartree
zpe.sumelectzpe: -726.794783 hartree
zpe.sumelectthermal: -726.777432 hartree
zpe.sumelectthermalent: -726.776488 hartree
zpe.sumelectthermalfe: -726.839248 hartree
dipole: 2.9171 -0.3292 0.8466
dipole: 3.0552
quadrupole: -89.8083 -105.6017 -97.2692
quadrupole: 2.5360 3.2736 5.5723
quadrupole: 7.7514 -8.0419 0.2905 2.5360 3.2736 5.5723
hfenergy: -727.0760357 hartree
pointgroup: C01 [X(C12H18N2O2)]
dipole: -1.1329452 -0.3882965 -0.1024968 debye
polarizability: 173.1962589|0.3722477|166.3393978|9.0020121|11.3618164|110.2993811 unknown
InChI: InChI=1S/C12H18N2O2/c1-6-13-10(15)12(5,8-9(3)4)14(7-2)11(13)16/h6-7,9H,1-2,8H2,3-5H3
charge 0 multiplicity 1
34 atoms
O  1.122427 -2.199924 -1.039521
O  1.18137 2.352075 0.19841
N  -0.588775 0.890242 -0.447078
N  1.522246 0.040126 -0.356475
C  -0.735294 -0.542824 -0.849431
C  -1.698144 -1.379663 0.052317
C  -1.514955 -1.45621 1.598558
C  0.71762 -1.045072 -0.764747
C  -1.191804 -0.656801 -2.330617
C  0.735379 1.234792 -0.158718
C  -0.152526 -2.037858 2.051361
C  -1.829702 -0.136832 2.346992
C  -1.684728 1.783473 -0.456083
C  2.925533 -0.090678 -0.181687
C  -1.67459 3.110915 -0.164038
C  3.78733 0.8796 0.211616
H  -2.728254 -1.024499 -0.15689
H  -1.635486 -2.409142 -0.352816
H  -2.29077 -2.188598 1.911462
H  -0.563448 -0.028554 -2.985486
H  -1.104295 -1.706275 -2.658643
H  -2.243409 -0.338688 -2.44245
H  0.674672 -1.320768 1.898014
H  0.099278 -2.9674 1.509808
H  -0.183304 -2.26676 3.132699
H  -1.061834 0.63628 2.172635
H  -1.873143 -0.323696 3.436192
H  -2.80445 0.284355 2.037747
H  -2.622922 1.289485 -0.732399
H  3.256646 -1.110465 -0.408998
H  -2.615993 3.664971 -0.218336
H  -0.765705 3.642013 0.12322
H  4.847978 0.628309 0.303463
H  3.464652 1.897475 0.43822
