program: Gaussian 09
title: 000294555
version: EM64L-G09RevD.01
frameworkgroup: C1[X(C13H16N2O2)]
method: RPBEPBE
basis: SDD
operation: Freq
keyword: #p
keyword: freq=noraman
keyword: PBEPBE/SDD
title: #p freq=noraman PBEPBE/SDD
converged: YES YES NO NO
title: Mulliken charges:
elementType: O O N N C C C C C C C C C C C C C H H H H H H H H H H H H H H H H
charge: -0.266927 -0.211191 -0.176368 -0.071460 0.336548 -0.030453 0.388713 -0.563618 0.365342 -0.528890 -0.527030 -0.227569 -0.824260 -0.819860 0.277758 -0.261767 -0.661497 0.238547 0.269673 0.260484 0.252653 0.254348 0.224821 0.227527 0.227225 0.234894 0.222179 0.222291 0.239970 0.227706 0.222999 0.228246 0.248967
chargesum: 0.00000
title: Mulliken charges with hydrogens summed into heavy atoms:
elementType: O O N N C C C C C C C C C C C C C
charge: -0.266927 -0.211191 -0.176368 -0.071460 0.336548 -0.030453 0.388713 -0.325071 0.365342 0.001267 -0.274377 0.026779 -0.144687 -0.140496 0.277758 0.205909 0.038714
polarizability: 2.09073388e+02 1.43881868e+01 1.70369348e+02 -1.77171324e+01 6.62448670e+00 1.04009531e+02
1716.lowfreq: -6.4566 -0.1275 -0.0004 0.0008 0.0009 7.4894 15.9634 24.1610 41.0617
frequency: 15.6231 24.0046 41.0326 67.8717 94.4830 114.6481 133.1195 145.6722 190.0542 195.7311 205.7349 243.4936 264.8897 299.9667 319.4857 333.8158 350.2507 370.2201 416.5209 433.7703 449.1604 476.0711 544.9911 576.5451 613.0424 652.0762 657.1768 706.7452 725.4837 770.3601 786.8876 802.6652 813.5048 828.9934 834.4593 852.8045 883.7623 894.7920 954.8890 998.6553 1004.2200 1012.6407 1030.9002 1037.3890 1052.3439 1093.9742 1113.9809 1132.9388 1156.0092 1165.0073 1174.5332 1222.2150 1251.0297 1276.9849 1279.6613 1320.1379 1333.9689 1356.4178 1359.5796 1389.4998 1391.8915 1393.5918 1406.3901 1438.3971 1440.0190 1459.0183 1462.1274 1462.6836 1463.8772 1469.4461 1477.3923 1483.6854 1485.6677 1491.2520 1582.9580 1644.6462 1664.4544 2966.9995 2967.6749 2994.1064 3014.0811 3032.9164 3037.3848 3040.6097 3075.8129 3079.0618 3084.2912 3089.4841 3095.0234 3121.8291 3125.6090 3151.1833 3219.0032
redmass: 4.4634 4.2876 4.2128 3.5584 4.1807 2.9380 1.8454 1.4894 1.4844 1.3192 2.0534 2.4668 2.7678 2.5153 3.4340 3.9547 3.3429 5.6001 3.1438 2.6649 5.2688 4.1219 3.8248 3.4839 4.1999 4.2210 3.8735 4.6523 5.4548 3.2777 2.9423 1.8217 1.4162 3.1176 3.5985 1.4842 3.6356 1.4668 2.3260 1.5447 1.5736 2.7628 1.4381 3.2515 1.6311 2.2599 2.8683 3.0136 1.6720 1.8757 3.5584 1.6595 1.2725 1.1196 2.7030 2.4717 1.3827 1.3646 6.6629 3.5780 1.2351 1.2443 1.2982 1.8044 1.7620 1.1238 1.7252 1.0625 1.0444 2.4891 1.0468 1.0519 1.2983 1.7956 8.2476 7.6917 9.4257 1.0375 1.0380 1.0360 1.0608 1.0599 1.0970 1.0969 1.1009 1.0984 1.0976 1.0975 1.1028 1.1067 1.0919 1.0924 1.0980
irintensity: 0.2974 0.6454 0.2331 1.3310 1.4414 0.3483 2.1477 0.6530 1.3078 0.8798 5.1046 0.7576 3.0511 0.4550 15.5123 1.4199 0.8360 4.9858 0.5266 11.8552 4.3969 0.6565 5.3483 0.8848 2.3062 16.6969 0.1279 19.3428 0.4037 2.0720 3.6589 1.3695 15.0652 4.4066 22.3866 20.8457 20.8237 13.8438 8.1632 22.3209 7.2714 53.8088 16.7284 4.7060 0.0849 72.9392 229.8636 130.4124 17.8081 21.0636 4.1181 30.0961 1.8146 4.7031 12.4005 24.5533 13.4207 3.5754 9.8227 9.9627 24.9819 8.7821 16.7911 19.9451 39.9979 17.4403 38.0357 1.5632 14.2104 39.3871 29.8091 12.4186 10.7034 45.1337 6.3552 4.5133 140.8957 75.7393 17.1261 17.6795 24.0429 23.4553 45.3988 2.1927 1.9146 33.0123 12.2429 30.9577 1.7877 30.4709 17.0988 8.1351 0.9576
temp: 298.150 k
press: 1.00000 atm
elementType: 8 8 7 7 6 6 6 6 6 6 6 6 6 6 6 6 6 1 1 1 1 1 1 1 1 1 1 1 1 1 1 1 1
symmnumber: 1
zpe: 700769.2 jmol-1
zpe.correction: 0.266909 hartree
zpe.thermalcorrener: 0.283804 hartree
zpe.thermalcorrenthalpy: 0.284749 hartree
zpe.thermalcorrgfe: 0.220140 hartree
zpe.sumelectzpe: -763.690922 hartree
zpe.sumelectthermal: -763.674027 hartree
zpe.sumelectthermalent: -763.673082 hartree
zpe.sumelectthermalfe: -763.737690 hartree
dipole: 3.5879 -3.6333 -2.1955
dipole: 5.5582
quadrupole: -79.0202 -101.6717 -104.5291
quadrupole: 5.4336 -3.1586 -4.3821
quadrupole: 16.0534 -6.5980 -9.4554 5.4336 -3.1586 -4.3821
hfenergy: -763.9578309 hartree
pointgroup: C01 [X(C13H16N2O2)]
dipole: 1.3713934 1.4987562 0.8093087 debye
polarizability: 207.9571703|-12.8383661|170.7222962|22.1315214|1.7460577|104.7728014 unknown
InChI: InChI=1S/C13H16N2O2/c1-4-17-13(16)7-15-8-14-11-5-9(2)10(3)6-12(11)15/h5-6,8H,4,7H2,1-3H3
charge 0 multiplicity 1
33 atoms
O  3.463214 1.00285 0.682689
O  2.543736 -0.247497 -1.06974
N  0.442761 -1.0551 0.774653
N  -1.048712 -2.623546 0.012715
C  -0.725687 -0.345062 0.438605
C  -1.646099 -1.337863 -0.027173
C  -2.364458 1.402023 0.090954
C  -1.067806 1.020052 0.50444
C  -3.304505 0.41427 -0.381069
C  1.688637 -0.484907 1.256924
C  -2.939729 -0.948323 -0.437485
C  0.184695 -2.406148 0.483611
C  -2.763805 2.866841 0.140832
C  -4.694893 0.840748 -0.822815
C  2.577126 0.07764 0.132935
C  4.478575 1.594421 -0.250167
C  5.70795 0.688661 -0.353958
H  -0.360413 1.781227 0.853645
H  1.494956 0.314668 1.992343
H  2.270188 -1.266064 1.780823
H  -3.647105 -1.703204 -0.795984
H  0.940029 -3.17584 0.636773
H  -3.65559 3.025922 0.777273
H  -1.947771 3.491659 0.542575
H  -3.019708 3.253721 -0.864673
H  -5.281915 -0.025679 -1.171058
H  -5.258607 1.319937 0.001304
H  -4.65536 1.575521 -1.650167
H  3.999996 1.742012 -1.23409
H  4.713783 2.566499 0.210815
H  6.479794 1.180706 -0.974163
H  6.140642 0.493457 0.642386
H  5.449979 -0.272502 -0.82945
