program: Gaussian 09
title: 000294544
version: EM64L-G09RevD.01
frameworkgroup: C1[X(C7H16ClO3P)]
method: RPBEPBE
basis: SDD
operation: Freq
keyword: #p
keyword: freq=noraman
keyword: PBEPBE/SDD
title: #p freq=noraman PBEPBE/SDD
converged: YES YES NO NO
title: Mulliken charges:
elementType: Cl P O O O C C C C C C C H H H H H H H H H H H H H H H H
charge: -0.012420 1.312178 -0.519123 -0.512789 -0.610841 -0.272667 -0.238881 -0.340326 -0.359881 -0.792837 -0.679615 -0.677451 0.236187 0.223435 0.221989 0.224424 0.229065 0.203366 0.212880 0.222727 0.310665 0.313161 0.220132 0.225829 0.209860 0.209197 0.227985 0.213749
chargesum: 0.00000
title: Mulliken charges with hydrogens summed into heavy atoms:
elementType: Cl P O O O C C C C C C C
charge: -0.012420 1.312178 -0.519123 -0.512789 -0.610841 0.186955 0.207533 0.092105 0.075726 -0.169011 -0.023793 -0.026520
polarizability: 1.28838238e+02 2.69403320e+00 1.26712624e+02 -3.35615766e+00 -8.11130129e+00 1.03479935e+02
1716.lowfreq: -18.5684 -11.5744 0.0022 0.0025 0.0026 5.8886 13.8795 19.5636 32.6103
frequency: 12.8119 18.7823 32.6021 52.4166 55.6893 74.3421 87.9929 109.5355 154.7779 166.1654 193.8535 221.2105 223.0753 226.3510 241.9929 266.2471 297.2495 342.4235 385.4419 403.9715 486.5210 579.2037 657.7834 677.0477 753.4769 760.2399 762.8238 831.9240 877.7955 878.9112 886.8386 889.3596 944.2246 958.7020 1034.6396 1044.5751 1045.6151 1120.1804 1124.2086 1136.9159 1142.2352 1150.0440 1225.8406 1240.3237 1244.0706 1277.5542 1287.4671 1299.7409 1308.6721 1361.4596 1362.7820 1392.2025 1393.5130 1395.0584 1457.0793 1469.2350 1477.0093 1479.2214 1479.3202 1479.6811 1487.6129 1489.4541 2977.9885 2980.6314 2986.8663 2996.3281 3002.7750 3005.5376 3038.6106 3045.2014 3064.8943 3071.7760 3074.2036 3083.1484 3084.3707 3086.3616 3092.1469 3166.7427
redmass: 3.7723 3.0442 4.8416 2.3370 3.5527 2.2704 2.2461 10.1365 3.0931 3.1002 3.1055 1.1137 1.5110 2.1384 4.3502 3.6243 6.7392 5.8800 6.9701 4.8082 5.8590 6.2891 8.1680 5.2823 5.2627 1.1527 1.0833 1.6241 1.2158 1.7154 1.3077 1.8546 5.1631 5.6451 11.0305 3.0713 3.0677 2.1573 1.9988 1.0728 1.4928 1.5449 1.2673 1.1808 1.2078 1.1094 1.1129 1.3045 1.2874 1.3257 1.3782 1.0761 1.2036 1.1994 1.0808 1.0715 1.0499 1.0598 1.0530 1.0419 1.0800 1.0839 1.0361 1.0358 1.0600 1.0578 1.0608 1.0586 1.1008 1.1015 1.1045 1.0546 1.1013 1.0990 1.0994 1.1055 1.1062 1.1111
irintensity: 0.8087 0.2037 0.9358 1.1596 1.9837 0.3166 1.8237 2.8183 4.8350 5.7234 5.0800 0.6980 0.4011 3.7196 10.0793 4.4966 10.2776 43.5827 2.8130 18.7428 28.4946 12.6264 72.7941 81.2814 36.1522 12.7480 5.5314 79.0627 7.6528 31.5870 16.4043 16.9112 182.9965 233.7997 113.1008 4.7949 10.1447 0.2830 2.7977 2.4643 0.6981 1.0692 0.2203 0.7883 0.4839 0.6557 0.2484 0.2157 0.7373 6.8897 3.5827 6.6391 15.0631 14.9490 3.6321 2.5739 3.3447 5.2146 7.4891 15.4900 21.3488 15.4751 31.5002 34.1336 12.8524 10.5589 53.1182 38.9826 4.4296 0.6078 3.0153 2.3853 21.1342 37.9921 39.0716 80.6157 42.4615 0.0344
temp: 298.150 k
press: 1.00000 atm
elementType: 17 15 8 8 8 6 6 6 6 6 6 6 1 1 1 1 1 1 1 1 1 1 1 1 1 1 1 1
symmnumber: 1
zpe: 596189.4 jmol-1
zpe.correction: 0.227077 hartree
zpe.thermalcorrener: 0.243987 hartree
zpe.thermalcorrenthalpy: 0.244932 hartree
zpe.thermalcorrgfe: 0.178276 hartree
zpe.sumelectzpe: -1302.276238 hartree
zpe.sumelectthermal: -1302.259327 hartree
zpe.sumelectthermalent: -1302.258383 hartree
zpe.sumelectthermalfe: -1302.325038 hartree
dipole: -1.1454 1.1012 -2.3404
dipole: 2.8288
quadrupole: -81.5118 -83.2442 -98.6999
quadrupole: -2.0375 5.3988 4.2251
quadrupole: 6.3068 4.5744 -10.8813 -2.0375 5.3988 4.2251
hfenergy: -1302.5033144 hartree
pointgroup: C01 [X(C7H16Cl1O3P1)]
dipole: 0.0906153 0.8732732 0.6839544 debye
polarizability: 125.9329157|-1.8780344|124.8144588|-12.8747652|-3.9042312|108.2834219 unknown
InChI: InChI=1S/C7H16ClO3P/c1-3-5-10-12(9,7-8)11-6-4-2/h3-7H2,1-2H3
charge 0 multiplicity 1
28 atoms
Cl -1.392682 -2.350287 2.589346
P  0.24435 -1.486457 0.056059
O  1.173489 -0.551489 1.190825
O  -1.135716 -0.536634 -0.360931
O  1.045672 -2.005061 -1.218356
C  2.407364 0.120125 0.677591
C  -1.659235 0.577896 0.487358
C  2.095436 1.436493 -0.047037
C  -2.120078 1.693182 -0.453949
C  -0.378238 -2.898415 1.121566
C  3.394941 2.159093 -0.468171
C  -2.777746 2.850741 0.331622
H  2.946832 -0.579189 0.009874
H  2.9992 0.291541 1.592688
H  -0.86745 0.926191 1.177105
H  -2.500075 0.172186 1.079057
H  1.480365 1.223821 -0.943018
H  1.498499 2.086995 0.620672
H  -1.252409 2.061774 -1.0324
H  -2.836579 1.27067 -1.18235
H  0.488402 -3.454294 1.505299
H  -1.019376 -3.537231 0.497636
H  3.998541 1.531007 -1.149268
H  3.164897 3.100787 -0.997072
H  4.02044 2.409233 0.40908
H  -2.073206 3.301007 1.056139
H  -3.1097 3.649148 -0.355265
H  -3.663638 2.501768 0.894498
