program: Gaussian 09
title: 000294543
version: EM64L-G09RevD.01
frameworkgroup: C1[X(C18H18N2)]
method: RPBEPBE
basis: SDD
operation: Freq
keyword: #pfreq=noraman
keyword: PBEPBE/SDD
title: #p freq=noraman PBEPBE/SDD
converged: NO YES NO NO
title: Mulliken charges:
elementType: N N C C C C C C C C C C C C C C C C C C H H H H H H H H H H H H H H H H H H
charge: -0.438030 -0.072461 -0.185209 0.206667 0.144544 -0.082724 -0.692829 -0.692820 0.289667 0.346380 -0.388789 -0.388800 -0.399358 -0.399375 -0.226034 -0.226041 -0.231092 -0.231091 -0.238871 -0.242931 0.195304 0.305117 0.243556 0.210321 0.214974 0.214967 0.210338 0.243532 0.241760 0.241758 0.233811 0.233848 0.228523 0.228523 0.223196 0.223196 0.230860 0.225615
chargesum: 0.00000
title: Mulliken charges with hydrogens summed into heavy atoms:
elementType: N N C C C C C C C C C C C C C C C C C C
charge: -0.132913 -0.072461 0.010094 0.206667 0.144544 -0.082724 -0.023978 -0.023983 0.289667 0.346380 -0.147029 -0.147042 -0.165548 -0.165527 0.002490 0.002482 -0.007896 -0.007896 -0.008012 -0.017316
polarizability: 2.32022649e+02 2.93133492e-01 1.90091757e+02 -2.04153394e-02 1.74099783e-02 1.78428402e+02
1716.lowfreq: -55.7219 -49.2001 -6.4156 -1.9201 -0.0007 -0.0004 0.0004 6.0632 13.0096
frequency: -55.6948 -49.1862 12.3687 39.0915 54.9869 75.3154 87.4381 131.8085 163.7553 219.8345 221.1341 236.1970 260.6785 310.0227 316.7552 351.1867 365.4264 373.1223 399.3951 402.1742 473.0680 497.4292 518.0048 580.5305 611.0701 618.2634 646.4276 668.1330 673.0882 702.1151 704.4370 715.7810 722.8373 741.1169 767.7617 779.5882 849.1511 856.5634 881.4146 917.9794 919.5830 927.6209 955.1158 956.3455 972.2502 979.5939 986.7870 989.4285 989.9378 993.0811 997.8717 1020.5497 1031.1913 1061.7439 1075.7813 1075.8275 1092.3249 1114.9353 1155.2814 1170.5189 1170.7016 1172.4234 1184.8099 1186.8098 1208.3290 1258.9469 1286.2199 1305.5126 1309.2175 1309.7193 1368.3341 1370.0949 1373.6174 1387.9832 1394.4578 1401.1804 1429.4092 1429.7219 1461.4940 1462.0574 1472.4687 1476.7218 1482.8185 1496.0336 1520.2224 1573.0149 1582.4126 1584.8698 1616.4221 1629.8052 2966.1418 2979.3635 2982.4691 3073.7472 3078.6176 3089.9276 3096.1441 3119.0949 3123.0662 3125.8124 3128.8129 3138.0333 3140.5258 3147.3175 3149.9449 3161.9451 3164.6517 3571.2020
redmass: 3.9343 3.7709 2.7548 5.3807 3.9830 4.1417 5.0834 3.7512 3.4487 1.0234 4.4587 2.8252 1.2580 3.9330 5.2744 4.4478 3.1239 4.4999 2.8092 2.8189 3.1648 6.8632 3.3354 3.4619 6.4831 6.4972 3.3816 6.4930 1.1571 1.6732 1.8111 3.6515 7.1366 9.9247 1.8811 2.1034 1.2465 1.2416 2.7669 1.1494 1.4657 1.4104 6.7688 1.5048 1.3912 1.3859 4.9469 6.1349 4.7267 1.4103 1.3228 2.9493 1.9995 1.9322 1.6003 1.5903 2.0682 2.4387 1.9343 3.6496 1.0533 1.0541 1.1141 1.1161 1.8951 5.4876 1.3567 2.1444 1.3617 1.3769 6.6537 7.1602 1.1934 1.5607 1.8150 3.3090 2.2192 2.2157 2.2881 1.0443 1.0496 1.0469 1.4638 2.0109 3.1929 6.5735 5.9763 6.0678 6.3619 7.2168 1.0818 1.0347 1.0369 1.1008 1.0999 1.1008 1.0999 1.0842 1.0845 1.0876 1.0879 1.0925 1.0926 1.0969 1.0970 1.1018 1.1018 1.0813
irintensity: 0.1932 0.0391 0.0642 0.1261 0.6329 1.1158 3.2930 0.1902 1.5733 0.0006 0.2242 0.9134 0.0991 1.2401 2.3374 2.5342 0.4328 2.7230 0.0590 0.0033 1.8183 0.7984 8.5892 20.9433 0.0140 0.0016 1.6756 3.2953 68.1309 61.0501 48.3026 5.1221 0.7939 0.0612 40.0240 51.5025 0.0172 1.0978 0.7994 4.7511 5.9068 3.0577 20.0335 0.1344 0.0002 0.3477 10.7354 2.9308 3.4493 0.1566 0.1789 6.4529 4.6080 14.1352 14.5809 5.3193 29.2708 1.7729 1.2433 25.6132 0.0002 0.0000 1.4358 0.1964 1.1608 16.6298 0.4283 50.9427 0.2443 0.6940 0.0671 0.0021 16.6409 12.6576 2.1031 34.5631 12.7241 1.3160 16.0276 4.4899 1.7814 17.1126 11.6019 11.6325 41.4591 9.0981 2.2255 1.1641 7.0333 1.0759 30.5246 34.0609 42.9903 17.5272 77.5058 5.6661 46.9516 1.7560 2.1695 0.6117 0.6121 25.6266 20.1369 30.2772 44.7017 21.2289 21.2559 28.0487
temp: 298.150 k
press: 1.00000 atm
elementType: 7 7 6 6 6 6 6 6 6 6 6 6 6 6 6 6 6 6 6 6 1 1 1 1 1 1 1 1 1 1 1 1 1 1 1 1 1 1
symmnumber: 1
zpe: 816773.5 jmol-1
zpe.correction: 0.311093 hartree
zpe.thermalcorrener: 0.327304 hartree
zpe.thermalcorrenthalpy: 0.328248 hartree
zpe.thermalcorrgfe: 0.265470 hartree
zpe.sumelectzpe: -804.818851 hartree
zpe.sumelectthermal: -804.802639 hartree
zpe.sumelectthermalent: -804.801695 hartree
zpe.sumelectthermalfe: -804.864474 hartree
dipole: 0.5156 -3.6886 -0.0002
dipole: 3.7244
quadrupole: -109.2891 -112.4577 -108.3255
quadrupole: 6.9200 -0.0036 0.0043
quadrupole: 0.7350 -2.4336 1.6986 6.9200 -0.0036 0.0043
hfenergy: -805.1299432 hartree
pointgroup: C01 [X(C18H18N2)]
dipole: -0.2072479 -1.4505772 0.0000815 debye
polarizability: 232.0204809|-0.420536|190.0939252|-0.0204681|-0.0173479|178.4284015 unknown
InChI: InChI=1S/C18H18N2/c1-13(2)18-19-16(14-9-5-3-6-10-14)17(20-18)15-11-7-4-8-12-15/h3-13,19H,1-2H3
charge 0 multiplicity 1
38 atoms
N  1.56746 -1.491475 0.000156
N  2.021558 0.70937 -0.000144
C  4.045444 -0.844261 -0.000023
C  2.568621 -0.523301 0.000016
C  0.316482 -0.846202 0.000047
C  0.621859 0.524199 -0.000141
C  4.725949 -0.283239 1.276666
C  4.725527 -0.284928 -1.27769
C  -0.968351 -1.592023 0.000149
C  -0.328862 1.669593 -0.000311
C  -1.595658 -1.953576 -1.221945
C  -1.595565 -1.953407 1.222341
C  -0.787982 2.228673 1.220015
C  -0.786731 2.229336 -1.220803
C  -2.818368 -2.660948 -1.222659
C  -2.818272 -2.660782 1.223247
C  -1.688146 3.31753 1.221755
C  -1.68689 3.318195 -1.222875
C  -3.432338 -3.017785 0.000342
C  -2.141871 3.864863 -0.000644
H  4.154133 -1.949479 0.000682
H  1.701653 -2.502844 0.000306
H  4.590052 0.811452 1.320175
H  5.808868 -0.506382 1.268766
H  4.28686 -0.718105 2.192925
H  4.285973 -0.720826 -2.193237
H  5.808404 -0.508282 -1.269973
H  4.589852 0.809741 -1.322477
H  -1.124419 -1.666982 -2.169115
H  -1.124249 -1.666689 2.169435
H  -0.431031 1.808497 2.167363
H  -0.428806 1.809674 -2.16801
H  -3.293085 -2.928102 -2.173413
H  -3.292915 -2.927808 2.174075
H  -2.033876 3.738024 2.173074
H  -2.031645 3.739205 -2.174319
H  -4.382467 -3.563837 0.000417
H  -2.840471 4.709515 -0.000772
