program: Gaussian 09
title: 000294560
version: EM64L-G09RevD.01
frameworkgroup: C1[X(C16H24N2O4)]
method: RPBEPBE
basis: SDD
operation: Freq
keyword: #p
keyword: freq=noraman
keyword: PBEPBE/SDD
title: #p freq=noraman PBEPBE/SDD
converged: YES YES NO NO
title: Mulliken charges:
elementType: O O O O N N C C C C C C C C C C C C C C C C H H H H H H H H H H H H H H H H H H H H H H H H
charge: -0.354603 -0.324412 -0.257853 -0.310425 -0.273783 -0.446439 0.364691 -0.496159 -0.727231 -0.716016 0.487836 0.261693 0.293247 -0.340643 -0.383481 -0.222363 -0.217554 -0.246394 -0.242879 -0.255700 -0.684410 -0.663788 0.257551 0.218226 0.235269 0.266116 0.208744 0.270500 0.206778 0.210584 0.383574 0.261274 0.233029 0.229214 0.227694 0.231098 0.222044 0.242942 0.213776 0.235885 0.216455 0.257144 0.247132 0.220394 0.249792 0.211453
chargesum: 0.00000
title: Mulliken charges with hydrogens summed into heavy atoms:
elementType: O O O O N N C C C C C C C C C C C C C C C C
charge: -0.354603 -0.324412 -0.257853 -0.310425 -0.273783 -0.062866 0.364691 -0.020383 -0.017103 -0.028154 0.487836 0.261693 0.293247 -0.079369 -0.150453 0.006851 0.010140 -0.015297 0.222107 0.193962 0.036321 0.017852
polarizability: 2.46340638e+02 2.84825745e+01 1.81148115e+02 -8.17528591e+00 8.70466886e+00 1.74920217e+02
1716.lowfreq: -5.6685 -3.3292 -0.0004 0.0002 0.0007 6.1376 19.4083 33.4320 42.8960
frequency: 19.3852 33.3263 42.8803 53.9577 56.6821 62.1331 68.7138 84.2810 97.2630 108.1379 121.9020 134.3013 155.1902 185.8111 200.2579 222.1874 229.2367 243.4079 260.7736 274.2105 284.0778 288.2788 308.4423 327.0629 346.9416 378.9864 401.0607 405.4428 409.5761 438.7998 444.3062 467.4798 508.8399 519.0981 607.5583 614.5906 640.4363 660.9296 684.2269 695.7868 707.5918 723.6296 747.0952 765.5746 770.2390 793.3587 799.6879 819.9454 835.4714 841.1195 878.8723 897.6460 910.1408 933.1208 936.3186 967.2762 971.9811 988.4806 991.3611 1002.7060 1016.9483 1021.9072 1032.1683 1046.1983 1080.3801 1094.3254 1099.0407 1104.4507 1152.5480 1154.1577 1169.1906 1173.9989 1176.8447 1189.3832 1206.5482 1223.3386 1252.7391 1277.3218 1279.3286 1282.0872 1320.0299 1347.6883 1357.0227 1360.1554 1372.5220 1373.3793 1383.3156 1386.0162 1393.7909 1397.9648 1440.8415 1446.9190 1454.1319 1454.9844 1458.1801 1460.1810 1467.6081 1471.7585 1481.1051 1483.5908 1485.2139 1490.4866 1498.8149 1516.0128 1594.3222 1608.1426 1648.3414 1664.6976 2981.3570 2987.6132 2988.6073 2994.1764 3023.7310 3034.1291 3037.6494 3075.5288 3082.2861 3082.9376 3086.7714 3092.1541 3092.2537 3101.1528 3104.7230 3107.7869 3112.6530 3118.2184 3128.7559 3137.4188 3149.6577 3163.9954 3177.3659 3420.9301
redmass: 4.2928 3.1603 3.6304 3.2944 3.8237 3.4813 3.6656 5.7493 5.3136 4.6061 3.5749 4.3640 4.1162 2.2299 2.6629 1.6239 1.0587 1.4111 2.3483 1.1969 4.5416 3.1085 2.4211 3.4565 3.5054 3.0627 3.7750 3.0423 2.7508 3.4137 3.2115 3.4140 3.3253 3.0026 5.2180 6.2362 4.2681 4.4058 3.4742 1.9157 11.1029 1.5226 2.2665 3.8004 2.5096 1.9188 1.2257 1.7288 1.2650 3.2629 2.3146 2.5768 1.4945 1.5296 2.7097 1.3809 2.5455 2.7341 1.7827 1.5471 2.2624 2.2294 2.2184 4.5466 1.9713 2.1499 2.2607 2.7958 1.6658 1.6563 1.8589 1.1164 2.7661 1.1619 2.8560 3.3820 3.1652 2.4958 1.2242 1.1150 1.3490 1.2684 1.2701 1.2762 1.4803 1.4571 5.6219 1.2430 1.2168 1.2236 2.1990 1.1048 1.0802 1.0768 1.1003 1.0486 1.0946 1.0453 1.0599 1.0506 2.2778 1.0530 1.0632 1.4789 6.3657 6.2241 9.6201 8.4127 1.0357 1.0362 1.0359 1.0360 1.0589 1.0590 1.0598 1.1001 1.0989 1.0979 1.1021 1.1011 1.1007 1.1003 1.1028 1.1003 1.1051 1.1073 1.0849 1.0885 1.0939 1.0977 1.0985 1.0799
irintensity: 0.0035 0.1314 1.2140 0.9186 1.1132 2.1219 2.1030 3.8443 1.2418 0.9486 1.7977 1.0826 0.8911 0.6278 0.9286 1.9685 0.1554 7.8246 0.5300 0.2220 4.3436 5.5361 6.9551 16.7696 8.8072 5.0158 1.0492 0.1725 1.6515 3.3582 2.3448 2.2842 10.9162 3.0015 5.5887 3.9527 9.1284 14.2041 35.6011 53.9866 14.9099 79.4533 32.9905 12.0803 29.3543 11.1800 6.7565 2.9050 0.1646 2.1732 17.2202 13.0618 2.9475 2.0847 10.8441 0.0512 45.9955 1.1712 0.5437 9.5236 30.8642 96.0586 63.4296 341.6026 44.3316 24.6113 85.2672 59.0810 46.0819 50.8730 41.0732 5.8359 39.7468 3.8424 44.1880 293.8687 105.5878 23.1670 1.4857 2.2751 0.7633 16.0234 13.8595 6.2013 83.3035 93.4521 21.7415 30.4452 28.5563 22.9756 7.9865 42.0773 5.2221 19.1817 50.1947 20.6449 103.0908 7.2934 13.4327 10.4892 109.1808 17.3748 15.3600 207.8126 5.4872 44.3342 339.4919 221.8142 27.5399 12.3560 24.9129 18.7443 41.9722 35.9570 19.9008 26.2204 32.3726 33.0632 13.7990 13.4651 8.5653 5.7162 19.3150 16.6083 35.3081 22.2057 3.4362 4.6172 30.4187 27.0726 3.0376 350.1268
temp: 298.150 k
press: 1.00000 atm
elementType: 8 8 8 8 7 7 6 6 6 6 6 6 6 6 6 6 6 6 6 6 6 6 1 1 1 1 1 1 1 1 1 1 1 1 1 1 1 1 1 1 1 1 1 1 1 1
symmnumber: 1
zpe: 1001869.8 jmol-1
zpe.correction: 0.381592 hartree
zpe.thermalcorrener: 0.405350 hartree
zpe.thermalcorrenthalpy: 0.406294 hartree
zpe.thermalcorrgfe: 0.326988 hartree
zpe.sumelectzpe: -1032.840091 hartree
zpe.sumelectthermal: -1032.816333 hartree
zpe.sumelectthermalent: -1032.815389 hartree
zpe.sumelectthermalfe: -1032.894696 hartree
dipole: -0.3347 0.5860 -1.3146
dipole: 1.4777
quadrupole: -121.3513 -138.2668 -122.9182
quadrupole: 19.6088 1.8914 0.5850
quadrupole: 6.1608 -10.7547 4.5938 19.6088 1.8914 0.5850
hfenergy: -1033.2216831 hartree
pointgroup: C01 [X(C16H24N2O4)]
dipole: 0.1302662 -0.2746959 -0.4955314 debye
polarizability: 247.9899568|26.9236686|177.9076275|6.7003844|-8.8653541|176.511386 unknown
InChI: InChI=1S/C16H24N2O4/c1-5-21-14(19)17-16(3,4)12-18(15(20)22-6-2)13-10-8-7-9-11-13/h7-11,17H,5-6,12H2,1-4H3
charge 0 multiplicity 1
46 atoms
O  -0.521919 -2.003797 -1.172721
O  -3.752219 0.042211 -0.057146
O  1.166444 -2.701416 0.302789
O  -3.103841 2.31609 -0.073671
N  1.212866 -0.551466 -0.68744
N  -1.665706 0.576808 -0.772193
C  -0.465759 1.380488 -1.133428
C  0.605969 0.381114 -1.679051
C  0.055226 2.167126 0.0948
C  -0.812908 2.357905 -2.289881
C  2.445069 -0.17685 -0.016334
C  0.680175 -1.815509 -0.44116
C  -2.831874 1.102296 -0.288249
C  2.575805 -0.344776 1.384012
C  3.523109 0.362132 -0.760052
C  3.771126 0.032231 2.030326
C  4.712724 0.749215 -0.104505
C  4.84284 0.587811 1.293253
C  -1.190093 -3.330089 -0.979951
C  -5.060119 0.454719 0.519673
C  -2.112885 -3.30606 0.241344
C  -4.987516 0.537445 2.047768
H  0.159073 -0.213431 -2.494018
H  1.416566 0.991638 -2.10723
H  0.292234 1.485156 0.928491
H  -0.716089 2.879631 0.430849
H  0.970669 2.729118 -0.164373
H  -1.637659 3.01905 -1.976733
H  0.060505 2.985265 -2.546225
H  -1.130643 1.80527 -3.193289
H  -1.603551 -0.442437 -0.893622
H  1.752933 -0.781059 1.956512
H  3.450538 0.459452 -1.848678
H  3.862426 -0.103741 3.113468
H  5.540788 1.163103 -0.690411
H  5.767293 0.884514 1.800097
H  -1.745892 -3.472042 -1.920944
H  -0.403737 -4.097375 -0.880589
H  -5.75689 -0.329994 0.181174
H  -5.346568 1.428262 0.084089
H  -2.663066 -4.263753 0.303633
H  -2.848968 -2.48577 0.172114
H  -1.526574 -3.188629 1.168232
H  -4.642761 -0.418964 2.478686
H  -4.296931 1.339765 2.357672
H  -5.988307 0.76354 2.46161
