program: Gaussian 09
title: 000294540
version: EM64L-G09RevD.01
frameworkgroup: C1[X(C16H22O)]
method: RPBEPBE
basis: SDD
operation: Freq
keyword: #pfreq=noraman
keyword: PBEPBE/SDD
title: #p freq=noraman PBEPBE/SDD
converged: YES YES NO NO
title: Mulliken charges:
elementType: O C C C C C C C C C C C C C C C C H H H H H H H H H H H H H H H H H H H H H H
charge: -0.436741 -0.009912 0.169221 -0.464303 -0.491752 -0.533694 0.446228 -0.764483 -0.779699 0.435716 -0.408581 -0.331329 -0.359878 -0.826028 -0.442743 -0.394508 0.285724 0.195001 0.230980 0.189543 0.212877 0.240434 0.205940 0.208014 0.212401 0.224681 0.206442 0.223096 0.213266 0.221988 0.204270 0.215252 0.224254 0.216792 0.226319 0.218904 0.216620 0.247845 0.351844
chargesum: 0.00000
title: Mulliken charges with hydrogens summed into heavy atoms:
elementType: O C C C C C C C C C C C C C C C C
charge: -0.084897 0.185090 0.169221 -0.043780 -0.038440 -0.119740 0.446228 -0.120959 -0.121349 0.435716 -0.204311 -0.116077 -0.135624 -0.164014 -0.226123 -0.146664 0.285724
polarizability: 1.96271597e+02 1.68100648e+01 1.52611331e+02 6.33395663e+00 -5.07913539e+00 1.65040498e+02
1716.lowfreq: -9.8689 -0.0006 -0.0004 -0.0001 4.5071 9.7286 22.3364 40.3704 63.1584
frequency: 21.2761 40.3234 63.1103 82.4687 154.9049 168.2522 171.4822 192.9074 210.7156 237.5297 247.9507 266.8646 291.8629 302.0339 330.1752 342.3415 348.5844 362.8501 394.6414 409.7358 412.9084 426.8089 477.7305 478.6130 505.2409 514.7826 567.3600 612.5162 638.6339 678.2016 734.2482 759.8415 796.7262 802.8362 805.8359 814.2667 833.5206 886.0804 914.8785 921.3348 929.7541 931.2467 939.5334 960.9120 964.5446 998.5287 1003.2723 1026.8800 1028.8165 1055.1585 1086.8232 1095.6459 1103.1529 1131.1403 1144.1809 1146.8868 1160.8880 1171.8263 1180.5251 1190.0286 1194.8038 1233.6794 1250.4095 1254.2880 1293.7942 1304.4958 1311.1566 1313.8758 1332.4790 1346.0918 1371.6571 1377.8333 1381.9559 1392.2124 1401.1794 1419.3619 1453.9697 1456.7323 1460.7604 1463.6918 1471.2578 1472.5378 1477.0905 1484.3832 1501.8664 1508.9942 1592.6887 1625.0839 1700.6664 2935.7706 2941.5600 2950.7951 2954.4256 2979.6758 2981.4340 2983.7608 2997.3781 3006.1908 3023.8396 3047.6351 3067.2827 3073.9280 3074.0234 3084.4377 3089.0503 3090.0472 3109.4637 3146.9613 3157.9585 3170.2865 3581.6427
redmass: 3.1735 4.5242 3.1449 3.5631 3.4668 1.3777 2.0392 1.8968 2.7430 1.4386 1.4956 1.9974 2.6446 4.2721 1.6567 2.6827 1.1146 3.4616 3.3813 2.7018 2.3423 2.1714 3.0293 3.2708 3.2133 3.4995 2.6161 4.4069 7.0778 3.0979 3.6835 2.9041 1.8321 1.3120 1.4602 3.3083 1.5706 2.5034 1.6925 1.6197 1.7150 1.5571 1.5381 1.3715 2.2024 1.3393 3.0287 1.4539 1.5789 2.2182 2.0202 1.9846 1.9473 2.0852 1.3746 1.3329 1.9186 2.1594 2.0068 1.2238 1.8963 1.5320 2.0292 1.6331 1.3302 1.5915 1.2861 1.3851 1.4428 1.7713 1.7132 4.2438 1.2866 1.2425 1.1952 3.1053 1.0856 1.0729 1.0527 1.0673 1.0830 1.0674 1.1107 1.0527 1.6152 1.3061 6.1907 6.3382 6.4961 1.0820 1.0616 1.0620 1.0384 1.0384 1.0705 1.0400 1.0800 1.0959 1.0966 1.1024 1.0996 1.0985 1.0981 1.0980 1.0906 1.0971 1.0894 1.0871 1.0925 1.0962 1.0660
irintensity: 0.4775 0.0177 0.4986 0.4734 0.3982 0.8832 0.2857 0.3056 0.3699 0.0156 2.7556 0.9657 0.5666 0.1641 0.4220 2.2890 141.4369 0.6119 6.6627 1.7645 5.8739 1.7863 7.0457 1.1064 5.6211 7.8463 21.2865 4.2706 0.8626 4.4607 3.7368 1.3167 13.0611 4.4865 25.0945 15.6821 40.1299 7.0321 2.5131 1.9727 3.0171 1.7812 2.4795 0.5580 6.4867 0.7646 8.3280 4.2838 9.3814 3.8498 1.0860 11.9765 24.5577 19.3582 142.3347 82.8327 11.1288 1.8458 8.6970 7.5195 1.7267 2.8374 16.3458 9.5252 0.3618 21.5738 2.6545 5.9444 1.0978 10.4869 11.8877 23.5402 19.5666 9.2204 22.5115 9.1463 6.5831 10.5768 8.0320 2.1243 12.6736 4.3487 5.2593 1.5863 106.7530 17.3260 9.8198 35.5219 0.8855 16.7960 38.7295 30.1000 77.0646 18.4436 15.8793 42.5293 39.9748 46.3918 30.8261 50.8058 2.2196 79.3965 29.9697 31.7685 46.2469 40.3687 20.1369 10.5172 20.0212 5.7597 36.8699
temp: 298.150 k
press: 1.00000 atm
elementType: 8 6 6 6 6 6 6 6 6 6 6 6 6 6 6 6 6 1 1 1 1 1 1 1 1 1 1 1 1 1 1 1 1 1 1 1 1 1 1
symmnumber: 1
zpe: 883852.9 jmol-1
zpe.correction: 0.336642 hartree
zpe.thermalcorrener: 0.353813 hartree
zpe.thermalcorrenthalpy: 0.354758 hartree
zpe.thermalcorrgfe: 0.292062 hartree
zpe.sumelectzpe: -696.819031 hartree
zpe.sumelectthermal: -696.801859 hartree
zpe.sumelectthermalent: -696.800915 hartree
zpe.sumelectthermalfe: -696.863611 hartree
dipole: 0.5231 0.2989 1.8203
dipole: 1.9174
quadrupole: -105.0670 -103.5376 -96.7845
quadrupole: 2.4387 -6.6922 -5.1268
quadrupole: -3.2706 -1.7412 5.0119 2.4387 -6.6922 -5.1268
hfenergy: -697.1556729 hartree
pointgroup: C01 [X(C16H22O1)]
dipole: 0.2077281 0.1681284 0.7054573 debye
polarizability: 196.3438015|17.1474051|151.9034992|5.0390581|-4.19063|165.6761252 unknown
InChI: InChI=1S/C16H22O/c1-12-4-6-13(7-5-12)16(2,3)14-8-10-15(17)11-9-14/h4,8-11,13,17H,5-7H2,1-3H3
charge 0 multiplicity 1
39 atoms
O  -4.487105 -2.099733 0.076853
C  1.334064 0.90676 -0.028054
C  -0.055527 1.677211 -0.064735
C  1.539397 0.003959 1.216328
C  1.606397 0.05747 -1.298685
C  2.999704 -0.495114 1.304565
C  -1.248413 0.689555 -0.012118
C  -0.112248 2.674045 1.131324
C  -0.11332 2.556157 -1.348413
C  3.505051 -1.0641 -0.014821
C  2.844071 -0.815368 -1.178316
C  -1.763477 0.215615 1.224495
C  -1.866683 0.188181 -1.192458
C  4.760829 -1.911684 0.046592
C  -2.83101 -0.705356 1.289986
C  -2.933515 -0.731921 -1.150702
C  -3.417588 -1.183331 0.09557
H  2.111947 1.702605 0.012052
H  0.859219 -0.866979 1.148305
H  1.285915 0.543491 2.147936
H  1.729828 0.7168 -2.180558
H  0.723279 -0.580931 -1.515567
H  3.083945 -1.270543 2.094226
H  3.66643 0.334133 1.627561
H  0.710185 3.408884 1.045156
H  -1.069151 3.227264 1.128869
H  -0.009992 2.186384 2.115365
H  -1.051642 3.139983 -1.375525
H  0.734525 3.266655 -1.352701
H  -0.05324 1.973648 -2.282266
H  3.219749 -1.261082 -2.111596
H  -1.334789 0.570395 2.166569
H  -1.524498 0.526169 -2.175276
H  5.601278 -1.347792 0.49964
H  5.078737 -2.249265 -0.955529
H  4.607323 -2.809228 0.679089
H  -3.201923 -1.044012 2.266697
H  -3.399586 -1.103782 -2.068086
H  -4.749867 -2.348645 0.99753
