program: Gaussian 09
title: 000294530
version: EM64L-G09RevD.01
frameworkgroup: C1[X(C7H7N3O2)]
method: RPBEPBE
basis: SDD
operation: Freq
keyword: #pfreq=noraman
keyword: PBEPBE/SDD
title: #p freq=noraman PBEPBE/SDD
converged: NO NO NO NO
title: Mulliken charges:
elementType: O O N N N C C C C C C C H H H H H H H
charge: -0.231081 -0.216923 -0.396415 -0.350000 -0.357928 0.171178 -0.021632 0.399594 0.161960 0.117538 -0.435632 -0.800468 0.318431 0.316380 0.251737 0.332614 0.238749 0.237920 0.263977
chargesum: 0.00000
title: Mulliken charges with hydrogens summed into heavy atoms:
elementType: O O N N N C C C C C C C
charge: -0.231081 -0.216923 -0.077984 -0.033620 -0.025314 0.171178 -0.021632 0.399594 0.161960 0.117538 -0.183896 -0.059821
polarizability: 1.34691834e+02 7.23166784e+00 1.24730293e+02 -1.14784496e+00 -3.15402670e-01 4.81488518e+01
1716.lowfreq: -4.9815 -0.0003 -0.0001 0.0004 4.5860 8.3431 82.1134 100.6375 153.0191
frequency: 82.1123 100.6109 153.0157 182.3047 216.1976 254.6030 285.2837 305.3321 387.9027 462.7518 504.3712 508.8502 517.9471 545.6720 564.2722 577.3230 618.8527 666.0161 677.1355 695.8740 770.2042 782.4680 867.1408 961.3660 990.8831 1026.0067 1050.7813 1089.6625 1113.5929 1131.7248 1195.0273 1280.2748 1312.8203 1348.2427 1366.2427 1401.8900 1403.8057 1464.9024 1467.7127 1549.6982 1556.4800 1588.5542 1654.6218 1673.9149 2976.5694 3050.3943 3119.1208 3175.9119 3457.4816 3524.5976 3553.1657
redmass: 6.6751 1.0947 4.5905 3.7770 8.3310 5.2284 3.3539 3.1842 8.0164 4.2402 1.9114 1.7096 2.6378 2.3434 4.4080 3.1545 5.1836 3.5491 4.3053 5.4167 4.6538 5.0662 1.5282 3.3239 1.9573 3.2037 1.5025 3.9741 4.0181 6.7548 1.8820 2.0122 1.2202 2.3930 2.4919 1.5249 1.5083 1.1194 1.0446 6.3472 7.8905 4.0391 7.1016 9.9642 1.0396 1.0980 1.0962 1.0926 1.0778 1.0801 1.0778
irintensity: 0.1272 0.0131 2.7092 0.6387 0.1298 0.9218 2.7693 7.3300 2.6475 33.6022 145.7328 22.7140 90.5818 84.8871 62.8687 77.8444 2.4054 66.6566 124.9660 14.0194 8.3506 17.6280 31.7120 11.8347 5.0337 9.5361 7.8898 4.2019 6.9392 32.4426 6.8575 10.8060 4.5117 30.4234 10.9911 3.0525 30.8281 23.7556 18.7763 337.8885 48.7658 113.1378 86.2416 548.9633 27.6950 17.2265 8.0776 3.5797 17.2886 37.9269 51.3399
temp: 298.150 k
press: 1.00000 atm
elementType: 8 8 7 7 7 6 6 6 6 6 6 6 1 1 1 1 1 1 1
symmnumber: 1
zpe: 366127.2 jmol-1
zpe.correction: 0.139450 hartree
zpe.thermalcorrener: 0.149713 hartree
zpe.thermalcorrenthalpy: 0.150657 hartree
zpe.thermalcorrgfe: 0.103813 hartree
zpe.sumelectzpe: -584.765308 hartree
zpe.sumelectthermal: -584.755045 hartree
zpe.sumelectthermalent: -584.754101 hartree
zpe.sumelectthermalfe: -584.800945 hartree
dipole: -6.1436 -10.0648 0.0786
dipole: 11.7920
quadrupole: -64.8662 -69.6293 -70.5261
quadrupole: -9.1752 -1.2961 -1.2757
quadrupole: 3.4743 -1.2887 -2.1856 -9.1752 -1.2961 -1.2757
hfenergy: -584.9047581 hartree
pointgroup: C01 [X(C7H7N3O2)]
dipole: 2.3163396 -4.0194259 -0.0450602 debye
dipolederiv: -0.470829 0.1871673 -0.0026238 0.0630797 -1.1189803 0.0039741 0.0103036 0.0089852 -0.3567408 -1.0400115 0.417017 0.0284863 0.3752851 -0.6528897 -0.0308082 0.0577804 -0.0324875 -0.3387141 -1.1573922 -0.2350775 0.0039537 0.0292054 -0.6587137 -0.0352889 0.0551121 -0.0552465 -0.242897 -0.3312849 -0.2210409 0.0580023 -0.4010833 -0.9268842 0.2265995 0.1461281 0.579832 -0.1344319 -0.2681229 -0.40348 -0.1183451 -0.1209875 -0.6007939 -0.217669 -0.3096952 -0.3986303 -0.338324 1.0572128 0.1084485 -0.039737 -0.0892832 0.9758888 -0.0809542 0.0191153 -0.0534293 0.0900978 -0.8383537 -0.0276387 0.0030519 -0.0483314 -0.764141 0.0111551 0.0084303 -0.0093225 -0.0764793 0.6313857 0.2090978 0.0001197 0.1319324 0.8476165 0.01317 -0.01366 -0.0048982 -0.009365 0.8944767 -0.2256966 -0.0014766 0.0907042 1.3708645 -0.0116085 -0.0359763 -0.003763 0.2059977 1.5433672 -0.3170504 0.0163153 -0.3657776 1.1139846 0.1373736 -0.0127115 0.0540786 0.2146169 -0.4719523 0.4291586 -0.0003902 0.1983138 -0.3419298 0.0012781 -0.0035018 0.0069547 -0.2028214 -0.1536416 -0.0282647 -0.001404 0.0705292 0.0037588 0.0002767 -0.0040225 -0.0068164 0.0922749 0.179403 -0.0300232 -0.0025332 -0.0157305 0.1800695 0.0101489 -0.0186087 0.045866 0.3185205 0.1123708 0.0765422 0.0080028 0.0861175 0.3122168 -0.0763437 -0.0498222 -0.300076 0.2492441 -0.0190813 -0.0552798 0.0006014 -0.0810985 0.0453957 -0.0001878 0.0057464 -0.0001229 0.1586395 0.2346893 0.081079 0.047461 0.0622831 0.204103 0.0477322 0.1436206 0.1677563 0.3130565 0.0266742 0.0341824 0.0033181 0.0739522 0.0195264 -0.1093506 0.0642008 -0.1165352 -0.0326116 0.0268323 0.0304957 -0.0023495 0.0717268 0.0220919 0.1097793 -0.0629079 0.1168191 -0.0371347 0.0442571 -0.0296365 -0.0004532 -0.1308376 -0.0311838 0.0007233 0.0004686 0.0010358 0.1270719 unknown
polarizability: 134.3287968|-7.4709827|125.0953139|-0.780028|0.7887121|48.1468689 unknown
InChI: InChI=1S/C7H7N3O2/c1-3-2-4(11)5-6(8-3)9-10-7(5)12/h2,8-10H,1H3
charge 0 multiplicity 1
19 atoms
O  -0.114613 2.649877 -0.03018
O  -3.022601 0.95219 0.027594
N  1.27594 -1.300544 -0.004105
N  -1.07057 -2.019792 0.027909
N  -2.309358 -1.304991 -0.143643
C  -0.074426 -1.030212 -0.002301
C  -0.608829 0.259559 -0.023395
C  2.189762 -0.22109 -0.006554
C  0.27434 1.436529 -0.018394
C  -2.079758 0.125951 -0.044399
C  1.714889 1.072337 -0.013338
C  3.649489 -0.609216 0.002656
H  1.624495 -2.256492 0.081232
H  -0.979472 -2.842631 -0.581412
H  2.427817 1.901393 -0.019421
H  -3.124849 -1.710212 0.326792
H  3.915102 -1.213563 -0.885886
H  3.907974 -1.19882 0.903509
H  4.280968 0.291526 -0.001063
