program: Gaussian 09
title: 000294526
version: EM64L-G09RevD.01
frameworkgroup: C1[X(C6H12N2O)]
method: RPBEPBE
basis: SDD
operation: Freq
keyword: #p
keyword: freq=noraman
keyword: PBEPBE/SDD
title: #p freq=noraman PBEPBE/SDD
converged: YES YES NO NO
title: Mulliken charges:
elementType: O N N C C C C C C H H H H H H H H H H H H
charge: -0.309836 -0.400937 -0.657423 -0.058599 -0.427904 -0.503304 -0.431973 -0.446429 0.273365 0.273984 0.201894 0.252079 0.228660 0.218452 0.216285 0.218703 0.208441 0.224224 0.286999 0.296043 0.337278
chargesum: 0.00000
title: Mulliken charges with hydrogens summed into heavy atoms:
elementType: O N N C C C C C C
charge: -0.309836 -0.113938 -0.024102 0.215386 0.026068 -0.056192 0.003015 -0.013765 0.273365
polarizability: 9.31771271e+01 -1.05240250e+00 7.68649911e+01 3.06629255e+00 4.38780919e+00 6.53612303e+01
1716.lowfreq: -45.4424 -26.4762 0.0002 0.0006 0.0009 10.4767 15.9951 32.9971 81.7214
frequency: -37.3496 26.8427 81.6767 131.8866 202.4369 221.0540 323.5764 387.0788 441.1612 468.8027 502.4530 599.6989 638.2711 676.4600 721.2761 791.5997 799.1256 874.7569 878.9584 896.2884 920.2810 969.8679 1017.1131 1030.1922 1058.2320 1073.0635 1085.8558 1151.5163 1183.1913 1206.1310 1222.4635 1247.2343 1282.3420 1289.0770 1294.2371 1311.2190 1320.6361 1363.7311 1461.8427 1471.6199 1473.9430 1483.8506 1495.6216 1598.0911 1645.0309 2987.4484 3000.1151 3004.1091 3012.5046 3042.4954 3053.1817 3064.0995 3075.3951 3089.6615 3540.6995 3551.5298 3701.8812
redmass: 1.8002 4.0293 3.3820 2.8456 2.4858 1.3952 2.4215 2.9854 1.1939 2.3735 1.1456 4.0391 3.0784 2.0958 6.6910 1.6756 1.7129 2.2727 3.8563 1.9968 2.5331 1.5808 1.6371 2.2592 2.4202 1.7839 1.3797 1.8629 1.4029 1.3483 1.6804 1.2749 1.2675 1.3260 1.4235 1.4967 1.5677 1.4887 1.0853 1.1323 1.0843 1.7333 1.2709 1.3763 3.3870 1.0622 1.0645 1.0610 1.0664 1.0990 1.0879 1.1028 1.1012 1.1017 1.0515 1.0711 1.1039
irintensity: 1.3764 7.9345 9.9015 5.0400 10.2919 6.1484 0.9372 4.0649 414.5819 9.2593 6.8163 3.7246 0.7135 8.6112 18.2916 2.7924 1.9604 1.5606 4.0339 10.3844 3.7442 0.8656 4.0979 10.0704 2.0352 3.5297 3.6840 5.0795 0.5772 1.0329 25.5025 4.2793 2.9292 1.0920 70.1680 19.2214 16.2167 26.7914 15.2598 64.1836 11.5175 326.8203 82.6249 103.7335 281.9745 25.2298 34.5327 62.5663 22.5338 15.4406 17.9867 3.3427 58.9154 66.1969 32.7240 6.1671 33.4219
temp: 298.150 k
press: 1.00000 atm
elementType: 8 7 7 6 6 6 6 6 6 1 1 1 1 1 1 1 1 1 1 1 1
symmnumber: 1
zpe: 475174.1 jmol-1
zpe.correction: 0.180984 hartree
zpe.thermalcorrener: 0.189971 hartree
zpe.thermalcorrenthalpy: 0.190915 hartree
zpe.thermalcorrgfe: 0.146063 hartree
zpe.sumelectzpe: -419.866134 hartree
zpe.sumelectthermal: -419.857147 hartree
zpe.sumelectthermalent: -419.856203 hartree
zpe.sumelectthermalfe: -419.901055 hartree
dipole: 1.5079 -3.9394 -1.3846
dipole: 4.4396
quadrupole: -52.3776 -53.9748 -55.4735
quadrupole: 9.7913 5.8037 1.4333
quadrupole: 1.5644 -0.0329 -1.5315 9.7913 5.8037 1.4333
hfenergy: -420.0471182 hartree
pointgroup: C01 [X(C6H12N2O1)]
dipole: -0.6426003 -1.5334052 0.5353219 debye
dipolederiv: -0.7994658 -0.1504234 -0.0046941 -0.2132947 -0.9317051 0.2028175 0.0092794 0.200415 -0.4783261 -1.3776775 0.0369428 -0.1577302 -0.2140299 -0.4449328 -0.1637453 -0.1747174 -0.0994709 -0.4739234 -0.9129892 0.4245885 -0.1692483 0.5134237 -0.618581 0.0838633 -0.2645117 0.0893901 -0.877198 0.5529491 -0.1718936 0.0688383 -0.3349305 0.2991347 -0.0168419 0.2300548 0.0199754 0.2916326 -0.0006737 -0.0417068 0.0264325 0.069977 0.0010728 -0.0554258 0.0163324 -0.1444762 0.0187081 -0.0030431 -0.0085972 0.0152867 -0.0566969 0.057467 -0.0588367 -0.025224 -0.019609 0.0574802 0.0848443 -0.0507422 0.0604883 -0.0441679 0.018269 -0.0199028 0.0358005 0.0097294 0.0621274 0.0847742 -0.0528814 0.0301877 -0.0510903 0.0767962 -0.0482469 0.0246668 -0.0537534 0.0077656 2.0748065 -0.0582121 0.4025456 0.1525969 1.2834247 -0.4141085 0.4142914 -0.4549587 0.6088931 -0.0160201 -0.0204289 0.0856882 0.0371879 0.0324242 0.0789483 0.0403487 0.0397823 -0.0462847 -0.0383844 0.1041874 -0.0482769 0.0946381 -0.0438452 0.0954683 -0.0283298 0.1263372 -0.019408 0.0046997 -0.0990401 -0.0659645 -0.0861224 0.0145644 -0.051181 -0.0716924 -0.0634356 0.0007147 0.0565874 0.061512 0.0501552 0.0471421 -0.1250774 -0.1263248 0.0529556 -0.0771984 0.0132066 -0.0393785 0.0333815 -0.0884316 0.05921 0.0322806 0.1160198 -0.0626517 0.0683029 -0.0522132 -0.1144887 0.1039753 0.0911566 0.0984108 -0.0012419 -0.0563447 0.057431 -0.047153 0.0365369 0.0415942 0.0133526 -0.1101793 0.004802 0.0192921 0.0752096 -0.0624478 0.0421664 -0.1296388 0.0676126 0.0738508 -0.023504 0.0107889 -0.1448885 0.0900858 -0.0076988 0.0982042 -0.0143427 -0.1968734 -0.0551513 -0.0395244 0.0012427 0.066068 -0.0092561 -0.0474901 -0.0133856 0.0550035 0.1337088 -0.0532349 -0.0324462 -0.0196104 0.1008314 0.1010816 -0.0512456 0.1148565 0.2425038 0.1849253 -0.0576875 -0.0484475 -0.0461826 0.113698 0.100774 -0.0473015 0.0887475 0.3431057 0.2124923 -0.0317914 -0.0423323 -0.0232942 0.1949488 0.0759461 -0.0378498 0.0755337 0.3536567 unknown
polarizability: 92.8362374|1.0929039|76.7094673|4.3585918|-4.5440798|65.8576439 unknown
InChI: InChI=1S/C6H12N2O/c7-6(9)8-5-3-1-2-4-5/h5,8H,1-4,7H2
charge 0 multiplicity 1
21 atoms
O  2.262025 1.084582 -0.261987
N  0.614015 -0.55895 -0.037699
N  2.789261 -0.926935 0.798186
C  -0.426438 0.249664 -0.707343
C  -1.099942 1.267373 0.253807
C  -1.614096 -0.653229 -1.121985
C  -2.117111 0.422131 1.07418
C  -2.482248 -0.806979 0.167602
C  1.902065 -0.064979 0.142409
H  0.050797 0.758795 -1.561883
H  -1.625892 2.02954 -0.353229
H  -0.354592 1.791338 0.874413
H  -1.286996 -1.618711 -1.549375
H  -2.191403 -0.127735 -1.904201
H  -3.009467 1.012479 1.347364
H  -1.656664 0.081072 2.019424
H  -2.258589 -1.756825 0.690066
H  -3.558559 -0.83249 -0.078268
H  0.34683 -1.467454 0.342634
H  2.554024 -1.871843 1.093112
H  3.73728 -0.586244 0.932872
