program: Gaussian 09
title: 000294587
version: EM64L-G09RevD.01
frameworkgroup: C1[X(C15H22Cl2NO5P)]
method: RPBEPBE
basis: SDD
operation: Freq
keyword: #p
keyword: freq=noraman
keyword: PBEPBE/SDD
title: #p freq=noraman PBEPBE/SDD
converged: YES YES NO NO
title: Mulliken charges:
elementType: Cl Cl P O O O O O N C C C C C C C C C C C C C C C H H H H H H H H H H H H H H H H H H H H H H
charge: -0.054778 -0.057816 1.392446 -0.486438 -0.524816 -0.245555 -0.601814 -0.252215 -0.807321 -0.134540 -0.601414 0.522070 0.247391 -0.408270 -0.393000 -0.194230 -0.223169 -0.232450 -0.227143 -0.242150 -0.258655 -0.555428 -0.538489 -0.665724 0.295402 0.269783 0.225505 0.383088 0.233778 0.240605 0.251085 0.232281 0.266313 0.229595 0.223735 0.224166 0.226427 0.231897 0.230817 0.285650 0.254713 0.279700 0.261294 0.244770 0.237068 0.215835
chargesum: 0.00000
title: Mulliken charges with hydrogens summed into heavy atoms:
elementType: Cl Cl P O O O O O N C C C C C C C C C C C C C C C
charge: -0.054778 -0.057816 1.392446 -0.486438 -0.524816 -0.245555 -0.601814 -0.252215 -0.424234 0.160862 -0.106126 0.522070 0.247391 -0.174492 -0.152395 0.289136 0.272738 -0.008715 -0.002977 -0.015723 0.204059 -0.015065 0.002505 0.031950
polarizability: 2.75275886e+02 6.65143948e+00 1.92562301e+02 -1.82309933e+00 -8.84896579e+00 1.93668187e+02
1716.lowfreq: -5.9716 -3.7632 0.0006 0.0014 0.0020 4.3392 9.9086 16.8521 20.1296
frequency: 9.1503 15.5285 20.0361 26.1485 28.2061 37.8471 38.6063 40.9683 49.3629 56.3223 65.5167 81.5319 85.5984 102.0774 116.2806 142.2563 168.0772 173.9785 184.2143 204.7534 210.4923 237.1209 250.2150 258.2308 291.1820 309.1125 328.7106 339.8385 348.2832 374.0339 403.4411 406.4065 413.0450 450.8582 470.4743 476.8086 510.6321 546.5095 590.0215 593.4490 604.7548 617.4841 621.1732 664.4239 676.6876 703.5739 708.0343 755.3603 772.3413 811.6608 816.6910 849.7549 853.0917 855.5064 857.8825 885.7933 920.6330 938.5950 946.0738 976.3464 980.1595 986.5324 989.8242 990.1449 995.8697 996.3645 1015.9587 1027.0853 1054.3736 1074.3597 1082.7325 1084.3108 1097.4402 1113.4481 1149.8943 1159.3942 1170.8756 1173.0533 1175.5253 1177.1418 1188.6573 1219.7340 1222.3269 1224.5530 1268.6124 1275.6736 1296.0981 1298.5038 1304.3331 1330.5897 1332.7457 1355.5278 1362.2993 1370.3052 1382.8822 1393.4384 1413.5727 1428.0177 1429.9258 1441.7402 1452.7506 1458.5456 1460.9198 1462.2761 1474.3535 1484.7067 1485.0754 1593.7695 1615.3907 1624.7913 2982.3914 2991.8310 2993.6931 2993.7957 3032.6006 3047.8860 3048.6179 3054.3055 3063.3283 3064.4926 3064.7903 3090.0206 3096.5096 3113.4135 3117.7334 3123.3817 3130.8728 3143.3598 3146.0279 3147.4627 3161.3911 3492.6431
redmass: 6.4054 4.7500 9.8445 4.0044 6.9006 4.5966 7.4106 5.8965 4.6659 5.2782 4.6127 8.8139 5.7125 4.9987 4.1796 4.2017 5.7971 5.2062 2.5144 3.4359 5.8264 2.0137 2.8771 2.9446 4.6476 3.2340 4.7668 4.4990 2.1616 4.6884 2.8177 3.3729 4.1192 3.8588 4.3271 5.6051 3.1363 1.4045 5.1942 5.1839 4.4958 6.2993 4.6361 4.1307 5.3301 2.5522 2.5955 1.8694 2.4656 2.1417 2.2755 2.3135 1.9672 1.4479 2.6165 3.6044 1.5661 2.4273 2.1600 1.4626 1.9354 2.0067 2.2115 5.9562 1.7004 1.9083 3.4191 2.1928 8.5640 2.6337 1.6656 2.5099 2.1298 5.2316 2.0268 1.6212 1.1477 1.1848 1.2967 1.2931 1.1281 2.5010 1.1425 1.1493 1.2367 1.1316 1.1995 1.1838 1.2778 1.3036 1.3129 1.3190 1.2778 1.2851 7.2469 1.2302 1.4253 1.1019 1.1024 2.1569 1.0777 1.0958 1.0736 1.0466 1.1152 2.2592 1.0597 6.0384 6.1350 8.2572 1.0572 1.0576 1.0526 1.0429 1.0601 1.0934 1.0964 1.0829 1.0669 1.0957 1.0812 1.0978 1.1022 1.0868 1.0870 1.1065 1.0911 1.0959 1.1099 1.1097 1.1015 1.0757
irintensity: 0.2944 0.2625 1.4801 0.7081 0.2574 0.3865 0.8622 1.0252 1.8358 3.8601 3.1667 0.9736 3.6973 1.3346 4.8366 2.3012 3.3137 0.7986 0.9111 9.3972 2.1363 1.1398 19.2546 4.1222 0.9902 13.5590 7.5784 17.8355 2.8049 11.0233 0.0181 4.3708 57.2297 28.6810 7.2642 2.1966 23.0408 96.5662 0.6167 0.8318 31.1039 0.0041 53.4875 41.0885 110.4284 21.2191 61.2216 27.1231 25.5204 8.3785 0.5596 11.3502 33.8190 9.6856 73.4683 152.5363 10.0017 137.1926 38.4618 0.5712 4.3615 69.0007 4.1289 0.2344 3.9128 85.1527 72.2524 6.1621 112.6735 88.4016 17.4641 30.8678 14.4585 130.9165 115.7851 43.0604 18.2664 0.1478 34.3008 21.7141 0.3291 1.2214 0.1203 1.1559 77.6706 11.4675 10.4346 21.1442 22.4984 34.8879 13.6125 18.6685 1.4645 1.8433 0.3698 22.7613 42.3305 11.8226 10.7601 8.1638 12.0578 11.1639 12.5224 14.1507 14.0979 15.8519 14.9877 1.6852 9.2727 141.7467 35.8798 44.3921 19.9791 9.4200 23.6980 0.7038 5.3260 7.3171 27.2957 12.8427 19.4961 32.2967 2.4699 6.8508 4.1942 23.7252 13.1680 40.0671 8.6862 6.9659 25.8420 71.3118
temp: 298.150 k
press: 1.00000 atm
elementType: 17 17 15 8 8 8 8 8 7 6 6 6 6 6 6 6 6 6 6 6 6 6 6 6 1 1 1 1 1 1 1 1 1 1 1 1 1 1 1 1 1 1 1 1 1 1
symmnumber: 1
zpe: 936307.2 jmol-1
zpe.correction: 0.356621 hartree
zpe.thermalcorrener: 0.384250 hartree
zpe.thermalcorrenthalpy: 0.385194 hartree
zpe.thermalcorrgfe: 0.290921 hartree
zpe.sumelectzpe: -2275.149920 hartree
zpe.sumelectthermal: -2275.122291 hartree
zpe.sumelectthermalent: -2275.121347 hartree
zpe.sumelectthermalfe: -2275.215620 hartree
dipole: 2.1045 2.8238 2.6147
dipole: 4.3863
quadrupole: -125.6977 -157.6504 -172.5947
quadrupole: 3.9232 -0.8391 1.1906
quadrupole: 26.2832 -5.6695 -20.6137 3.9232 -0.8391 1.1906
hfenergy: -2275.5065409 hartree
pointgroup: C01 [X(C15H22Cl2N1O5P1)]
dipole: -0.9649579 1.4256816 -0.1196849 debye
polarizability: 275.48101|4.680211|184.3978691|-3.5420967|0.7904225|201.6274956 unknown
InChI: InChI=1S/C15H22Cl2NO5P/c1-2-21-15(19)14(12-13-6-4-3-5-7-13)18-24(20,22-10-8-16)23-11-9-17/h3-7,14,18H,2,8-12H2,1H3
charge 0 multiplicity 1
46 atoms
Cl 0.052496 2.392861 2.83578
Cl -3.275531 -1.536218 -2.969476
P  -2.299164 -0.776028 0.78075
O  -2.328169 0.207205 2.204655
O  -3.809762 -0.388965 -0.002962
O  1.928705 1.633927 -0.287983
O  -2.097196 -2.300867 1.176346
O  0.394492 1.475568 -2.04151
N  -1.222822 0.003073 -0.303508
C  0.242288 -0.072382 -0.134283
C  0.819314 -1.443206 -0.647697
C  2.312497 -1.600489 -0.41679
C  0.835429 1.092764 -0.928875
C  3.241259 -1.385984 -1.466536
C  2.806812 -1.95013 0.866591
C  -2.567575 1.660439 2.083941
C  -4.646022 -1.496625 -0.507928
C  4.630712 -1.514797 -1.242207
C  4.194396 -2.077425 1.096212
C  5.112211 -1.85912 0.041924
C  2.629095 2.76928 -0.973624
C  -1.801254 2.355883 3.194661
C  -4.880258 -1.309156 -1.998389
C  1.966794 4.098856 -0.603768
H  0.498448 0.062403 0.93067
H  0.254955 -2.22931 -0.110951
H  0.571856 -1.529597 -1.722266
H  -1.558765 0.187545 -1.256804
H  2.871855 -1.123643 -2.4663
H  2.099589 -2.13254 1.685595
H  -2.259931 2.028541 1.086553
H  -3.652461 1.839962 2.221214
H  -4.177382 -2.472475 -0.279442
H  -5.618722 -1.432846 0.017163
H  5.334755 -1.353425 -2.066737
H  4.559772 -2.351714 2.092422
H  6.188917 -1.962944 0.218025
H  2.604253 2.589997 -2.062794
H  3.660672 2.69554 -0.5958
H  -1.908936 1.825493 4.151578
H  -2.107944 3.409208 3.289252
H  -5.224392 -0.29201 -2.234608
H  -5.580622 -2.063211 -2.390746
H  0.944532 4.155311 -1.013858
H  1.918813 4.221121 0.491804
H  2.55529 4.935632 -1.023697
