program: Gaussian 09
title: 000294520
version: EM64L-G09RevD.01
frameworkgroup: C1[X(C10H5NO2)]
method: RPBEPBE
basis: SDD
operation: Freq
keyword: #p
keyword: freq=noraman
keyword: PBEPBE/SDD
title: #p freq=noraman PBEPBE/SDD
converged: YES YES YES YES
title: Mulliken charges:
elementType: O O N C C C C C C C C C C H H H H H
charge: -0.137790 -0.137792 0.013153 -0.343778 0.226892 0.226890 -0.001384 -0.001380 -0.345731 -0.345731 -0.200839 -0.200838 -0.124416 0.311548 0.282686 0.282686 0.247913 0.247912
chargesum: 0.00000
title: Mulliken charges with hydrogens summed into heavy atoms:
elementType: O O N C C C C C C C C C C
charge: -0.137790 -0.137792 0.013153 -0.032230 0.226892 0.226890 -0.001384 -0.001380 -0.063046 -0.063045 0.047074 0.047074 -0.124416
polarizability: 1.61721656e+02 3.51494826e-05 1.22294138e+02 2.70270932e+00 4.33644071e-05 5.64336020e+01
1716.lowfreq: -6.2363 -3.4669 -3.0268 -0.0005 -0.0003 -0.0002 29.7758 113.4120 122.8108
frequency: 29.7755 113.4116 122.8107 148.3858 208.9733 235.6867 319.4053 390.8836 409.2558 421.7872 448.5889 512.7501 522.6337 526.7336 597.6218 668.5451 696.5448 762.3893 764.6581 814.6977 838.2315 911.6156 928.9849 939.9685 989.3552 1012.8487 1017.1339 1080.6737 1081.4907 1141.1273 1173.8666 1189.5705 1221.6303 1254.4072 1281.9845 1410.1486 1452.3373 1456.0351 1593.3618 1596.9449 1639.1978 1668.7669 2202.7252 2990.8042 3143.2829 3156.0476 3167.2737 3176.6488
redmass: 10.5103 6.6486 7.2006 8.2128 6.7331 6.9008 12.2518 4.3117 7.3242 5.7562 5.8567 5.5798 7.6459 8.7981 3.5421 6.5819 6.4274 1.7751 4.1153 2.7612 5.5045 1.4677 6.2141 6.7531 1.4217 2.1887 1.3675 2.4340 2.4944 1.3702 1.1031 1.9733 1.6809 4.0954 1.6076 7.9061 2.4960 2.5709 7.0498 7.6216 11.6756 12.9852 12.5378 1.0801 1.0869 1.0904 1.0959 1.1006
irintensity: 2.0985 0.9733 0.3772 4.4387 4.6670 0.0550 8.9072 1.0013 0.4248 1.7560 0.0095 11.7173 0.4545 15.0337 1.4148 12.9427 1.3184 64.2606 0.0677 28.8618 1.7296 0.4230 33.5800 4.8745 3.1548 0.2559 0.0113 12.9856 1.7396 5.7976 17.8741 5.1006 12.3276 258.3122 2.7339 6.2050 2.2684 0.1723 121.0624 0.1509 257.4209 74.1826 23.8335 5.8701 1.5377 2.5359 2.4646 17.9320
temp: 298.150 k
press: 1.00000 atm
elementType: 8 8 7 6 6 6 6 6 6 6 6 6 6 1 1 1 1 1
symmnumber: 1
zpe: 319594.3 jmol-1
zpe.correction: 0.121727 hartree
zpe.thermalcorrener: 0.131896 hartree
zpe.thermalcorrenthalpy: 0.132840 hartree
zpe.thermalcorrgfe: 0.084968 hartree
zpe.sumelectzpe: -588.364124 hartree
zpe.sumelectthermal: -588.353956 hartree
zpe.sumelectthermalent: -588.353012 hartree
zpe.sumelectthermalfe: -588.400884 hartree
dipole: 7.5670 0.0000 -1.5779
dipole: 7.7298
quadrupole: -76.1671 -82.0047 -73.9121
quadrupole: -0.0001 9.1993 -0.0002
quadrupole: 1.1942 -4.6434 3.4492 -0.0001 9.1993 -0.0002
hfenergy: -588.4858513 hartree
pointgroup: C01 [X(C10H5N1O2)]
dipole: -2.9888679 0.0001232 0.5613454 debye
dipolederiv: -0.5583116 -0.1939805 -0.0553533 -0.2148437 -0.9312914 -0.0984147 -0.0718911 -0.0296558 -0.2941048 -0.5582958 0.1939468 -0.0553807 0.2148178 -0.9312822 0.098524 -0.071939 0.029816 -0.2941357 -0.3143931 0.0000005 -0.029757 0.0000149 -0.1841318 -0.0000018 0.1019349 -0.0000038 -0.1986298 -0.4833117 0.00001 0.0320138 0.0000023 -0.2999288 0.0000419 -0.026301 0.0000309 0.1239219 -0.5560145 -0.2654706 -0.078883 -0.300942 -0.1412563 -0.076181 -0.107185 -0.0595981 0.0054238 -0.5559929 0.2654737 -0.0789351 0.3009341 -0.1412504 0.076215 -0.1072527 0.0596212 0.0053948 1.2971301 0.2951311 0.1853069 0.007162 1.1793807 0.124053 0.2720979 0.0488854 0.1695568 1.2971168 -0.2950992 0.1853552 -0.0071122 1.1793558 -0.1242462 0.2721079 -0.0491013 0.1695972 -0.1491253 0.1247568 0.0010521 -0.1265783 0.1340969 -0.010873 -0.0128794 0.0243713 -0.0939147 -0.1491249 -0.1247455 0.0010743 0.1265867 0.1340931 0.0108326 -0.0129008 -0.0244149 -0.0939124 0.1319513 -0.1284761 0.0498938 -0.1123295 -0.0580978 -0.0237398 0.0486921 -0.0254043 -0.111213 0.1319631 0.1284783 0.0498701 0.1123317 -0.0580991 0.0237266 0.0486664 0.0253916 -0.1112229 0.2846642 -0.0000182 -0.099916 -0.0000374 -0.0932097 0.0000201 -0.2846738 0.0000197 0.0565648 0.065755 0.0000014 -0.011789 0.0000029 0.1141812 -0.0000066 0.0457956 -0.0000079 0.0464769 0.1052139 -0.0196695 -0.0120613 0.0248306 -0.0088273 0.002925 -0.0090709 -0.0040196 0.1595409 0.1052124 0.0196636 -0.0120646 -0.0248364 -0.0088262 -0.0028942 -0.0090593 0.0040488 0.1595419 -0.0472156 0.0688393 -0.0352194 0.0721704 0.0575463 0.0139415 -0.0380763 0.0112523 0.150555 -0.0472214 -0.0688421 -0.0352069 -0.0721737 0.0575471 -0.0139224 -0.0380656 -0.0112317 0.1505594 unknown
polarizability: 161.572143|-0.0004647|122.2941372|4.7983502|-0.0064824|56.5831151 unknown
InChI: InChI=1S/C10H5NO2/c11-5-8-9(12)6-3-1-2-4-7(6)10(8)13/h1-4,8H
charge 0 multiplicity 1
18 atoms
O  1.029511 2.438118 0.372873
O  1.029406 -2.438097 0.373377
N  3.774063 -0.000192 -0.985469
C  1.612082 0.000019 0.558627
C  -0.693262 0.709912 0.078471
C  -0.69329 -0.709878 0.078597
C  0.675524 1.239593 0.329735
C  0.675481 -1.239564 0.329933
C  -1.881096 1.439323 -0.14156
C  -1.881154 -1.439283 -0.141294
C  -3.071707 0.711899 -0.365002
C  -3.071736 -0.711852 -0.364868
C  2.809865 -0.000098 -0.283485
H  1.928805 0.000109 1.622531
H  -1.866578 2.533577 -0.140515
H  -1.866677 -2.533537 -0.14005
H  -4.010593 1.246768 -0.543168
H  -4.010644 -1.246717 -0.542933
