program: Gaussian 09
title: 000294519
version: EM64L-G09RevD.01
frameworkgroup: C1[X(C6H11ClOS)]
method: RPBEPBE
basis: SDD
operation: Freq
keyword: #p
keyword: freq=noraman
keyword: PBEPBE/SDD
title: #p freq=noraman PBEPBE/SDD
converged: YES YES NO NO
title: Mulliken charges:
elementType: Cl S O C C C C C C H H H H H H H H H H H
charge: -0.092936 0.145211 -0.183165 -0.029747 -0.681892 -0.572321 -0.674295 -0.003889 -0.707979 0.254837 0.281252 0.291007 0.266916 0.278536 0.215000 0.229399 0.225745 0.254191 0.248905 0.255225
chargesum: 0.00000
title: Mulliken charges with hydrogens summed into heavy atoms:
elementType: Cl S O C C C C C C
charge: -0.092936 0.145211 -0.183165 0.225090 -0.109633 -0.026869 -0.004151 -0.003889 0.050343
polarizability: 1.20538346e+02 1.52984638e+00 9.12569215e+01 1.19515002e+01 2.72416142e+00 6.98858571e+01
1716.lowfreq: -51.9460 -19.0594 -11.2432 -0.0016 -0.0010 0.0014 9.3552 33.8374 44.3481
frequency: -51.6050 33.7684 44.2579 81.4253 95.3392 175.6066 206.3700 216.9519 244.3027 295.2471 363.2687 400.1965 459.1731 482.7930 501.7731 583.7170 637.2727 688.3919 808.5185 854.7380 905.1242 942.5647 956.2948 1014.0943 1042.4020 1062.2292 1120.3134 1143.0355 1160.3589 1219.4206 1260.3773 1284.9385 1315.3599 1337.6363 1372.4777 1390.5925 1412.2541 1441.1590 1447.1403 1450.4580 1476.7286 1481.6544 1637.8574 2973.7087 2986.3494 2996.5771 3035.6468 3051.0524 3082.9828 3087.3851 3092.3434 3115.8479 3125.9555 3134.3311
redmass: 1.1117 6.7312 6.2327 3.3238 5.4433 4.1428 1.3422 2.4864 2.5821 2.5896 2.6343 3.1008 7.9504 3.4695 3.3755 4.0718 4.4835 4.7183 2.5856 1.5428 1.8155 2.1749 1.6573 1.5448 1.4828 1.5359 2.4947 1.5742 1.2538 1.3287 1.2230 1.2347 1.4626 1.4652 1.2223 1.1918 1.0951 1.0975 1.0637 1.0467 1.0456 1.0566 8.7894 1.0814 1.0359 1.0356 1.0574 1.0572 1.0995 1.0975 1.1004 1.1069 1.1012 1.1112
irintensity: 1.4713 1.4650 2.1617 3.7459 0.5782 1.6167 1.3907 6.9985 8.9277 1.8704 0.2188 0.1409 4.2055 4.6657 0.1383 78.3840 18.8874 30.2505 11.3340 9.0896 10.6300 55.1649 10.6116 3.8985 1.1970 0.2357 166.9232 5.9695 0.8170 4.8291 13.6003 5.2203 3.3600 11.5531 49.3711 15.8150 23.6357 18.2479 24.9845 23.0064 14.6156 11.4644 157.0012 4.9634 24.7894 1.1849 11.9110 20.2748 32.0789 6.0636 17.7115 0.7270 10.7057 10.5385
temp: 298.150 k
press: 1.00000 atm
elementType: 17 16 8 6 6 6 6 6 6 1 1 1 1 1 1 1 1 1 1 1
symmnumber: 1
zpe: 417076.6 jmol-1
zpe.correction: 0.158856 hartree
zpe.thermalcorrener: 0.169882 hartree
zpe.thermalcorrenthalpy: 0.170826 hartree
zpe.thermalcorrgfe: 0.120246 hartree
zpe.sumelectzpe: -1167.863413 hartree
zpe.sumelectthermal: -1167.852388 hartree
zpe.sumelectthermalent: -1167.851443 hartree
zpe.sumelectthermalfe: -1167.902023 hartree
dipole: 1.8509 0.1047 1.2335
dipole: 2.2267
quadrupole: -69.8107 -73.9651 -66.1438
quadrupole: -9.6033 0.4572 -1.1212
quadrupole: 0.1624 -3.9919 3.8294 -9.6033 0.4572 -1.1212
hfenergy: -1168.0222691 hartree
pointgroup: C01 [X(C6H11Cl1O1S1)]
dipole: -0.6827381 0.0032952 -0.5489255 debye
dipolederiv: -0.4267652 0.1554678 -0.1140861 0.144201 -0.2979578 0.0622961 -0.1813675 0.1223977 -0.3208876 -0.7337246 0.1235707 -0.1855669 0.2797353 -0.2959782 0.1937986 -0.3005232 0.1094141 -0.2743831 -0.5354025 -0.091609 -0.0770242 0.3637957 -1.0108476 0.3316536 -0.2079377 0.1681676 -0.3459063 -0.0565448 0.0552689 -0.0367246 -0.0662704 -0.0134416 -0.0081046 -0.2225255 0.0437754 -0.0207889 0.3898347 0.1366104 0.0388672 0.2682393 0.0527369 0.0209044 0.0423154 -0.008216 0.0723588 0.4491958 -0.2262346 0.2426443 -0.261309 0.2455452 -0.1565787 0.3004286 -0.1926385 0.3662745 -0.0588952 -0.0548879 -0.0033014 -0.031544 -0.0155387 -0.0440715 0.1331967 0.0115103 0.0658711 1.225237 -0.0661273 0.4654165 -0.6473324 1.0840558 -0.5001165 0.688603 -0.3071837 0.3675342 -0.4079154 -0.167599 -0.1286121 -0.1611074 -0.0886868 -0.0303785 -0.1451412 -0.037746 -0.0018708 0.0210387 0.0289805 -0.1088205 0.0608275 0.0219177 0.0333383 -0.0450729 -0.028374 -0.0267727 0.0132451 -0.0183074 -0.0979253 -0.0686923 0.0879741 0.0457453 -0.0273445 0.0288204 0.0089968 -0.0113949 0.0267435 0.0275631 -0.0200819 -0.0446879 -0.0827006 0.0373776 -0.0104975 0.0756368 -0.0644141 0.0442847 0.0449578 0.017197 0.0816973 0.0768004 0.04664 0.0413199 -0.0915601 0.0324694 -0.0788676 -0.09878 -0.042918 -0.0443436 -0.0040341 -0.1120028 0.0318254 0.0340361 -0.0476822 -0.0638925 0.103218 -0.067209 0.0732961 0.0001415 0.1337668 0.0480796 -0.069654 0.0444185 -0.0182223 -0.0767996 0.0392844 0.0897698 0.0672704 -0.1151425 0.0053992 -0.0413439 0.033247 0.1295253 0.021971 0.0878547 -0.0833675 -0.04196 0.0137025 -0.052793 0.0902987 0.0727081 -0.0147239 0.0136067 -0.0184022 0.1159191 0.0545797 0.0575241 0.0584703 -0.0299432 0.0733232 0.0715384 0.0391052 0.0462899 0.0151316 -0.0868554 -0.0014863 -0.0778258 0.0633549 -0.0119783 0.0284811 -0.0697092 0.0774418 0.0268063 0.0682718 -0.0950106 0.0460944 0.0787488 unknown
polarizability: 117.9480212|-1.0518976|89.2262977|15.6266022|-8.1124873|74.5068056 unknown
InChI: InChI=1S/C6H11ClOS/c1-5(3-7)4-9-6(2)8/h5H,3-4H2,1-2H3
charge 0 multiplicity 1
20 atoms
Cl 3.290024 -1.43845 0.592104
S  -0.934138 -1.010921 0.597313
O  -1.904142 1.321164 -0.48594
C  1.366952 0.461078 -0.326285
C  0.45069 0.247175 0.89632
C  2.10272 -0.811967 -0.757551
C  2.328475 1.644038 -0.058987
C  -2.148448 0.115215 -0.264801
C  -3.43491 -0.595704 -0.641595
H  0.718956 0.733573 -1.186833
H  1.013943 -0.142098 1.760697
H  -0.051321 1.191985 1.161969
H  2.745148 -0.639383 -1.634193
H  1.414587 -1.653353 -0.931526
H  2.979894 1.824454 -0.933645
H  2.977149 1.434705 0.809909
H  1.758882 2.569192 0.139812
H  -3.94045 -0.974935 0.26462
H  -3.220874 -1.464578 -1.289267
H  -4.103838 0.102108 -1.16892
