program: Gaussian 09
title: 000294515
version: EM64L-G09RevD.01
frameworkgroup: C1[X(C5H8ClNO4)]
method: RPBEPBE
basis: SDD
operation: Freq
keyword: #p
keyword: freq=noraman
keyword: PBEPBE/SDD
title: #p freq=noraman PBEPBE/SDD
converged: YES YES NO NO
title: Mulliken charges:
elementType: Cl O O O O N C C C C C H H H H H H H H
charge: -0.068133 -0.445343 -0.377854 -0.248695 -0.258164 -0.356085 -0.160018 -0.369062 0.197552 0.305301 -0.664102 0.288224 0.242143 0.213606 0.348520 0.295913 0.297386 0.371520 0.387291
chargesum: 0.00000
title: Mulliken charges with hydrogens summed into heavy atoms:
elementType: Cl O O O O N C C C C C
charge: -0.068133 -0.073824 0.009436 -0.248695 -0.258164 -0.007564 0.128206 0.086687 0.197552 0.305301 -0.070802
polarizability: 9.39806176e+01 -4.60204454e+00 8.75515169e+01 -3.00969008e+00 8.67109614e+00 6.78329315e+01
1716.lowfreq: -12.5806 -1.0861 -0.0024 -0.0018 -0.0010 4.7210 22.7042 37.8335 61.6941
frequency: 22.6573 37.8087 61.6595 86.7911 91.8448 154.3995 189.6876 243.3452 266.7601 329.6050 353.6167 383.7559 506.0653 553.8298 570.5557 591.0946 626.6416 665.6725 695.7722 719.1980 739.5924 814.0298 899.3215 908.3834 966.1186 973.5795 1039.2269 1080.8579 1108.5012 1154.7757 1199.6934 1226.4886 1258.6683 1264.0761 1298.3260 1345.2848 1354.4087 1387.5346 1418.6057 1457.5199 1488.4884 1604.5098 1630.0838 2992.7558 3032.5106 3070.6794 3100.8456 3151.3907 3482.9412 3496.3485 3501.3481
redmass: 10.1381 6.7228 7.2333 6.8443 3.7780 5.1144 5.6466 5.4435 5.2050 4.4157 5.2112 8.0459 3.7031 2.7628 1.3541 2.2387 1.5078 5.4412 4.0791 2.8973 1.4325 3.5634 3.1061 1.7736 2.5025 3.8912 3.1194 2.1023 2.3975 1.1139 1.3163 1.6579 1.1991 1.6445 1.7381 1.2913 1.7091 1.2820 1.0912 1.0843 2.1492 9.7384 8.0403 1.0668 1.0831 1.0567 1.0990 1.1090 1.0776 1.0651 1.0643
irintensity: 1.2037 0.2021 2.5187 7.4235 11.0447 7.7755 12.7668 3.1350 8.8831 4.5664 2.9740 9.6517 40.6202 45.1952 84.0804 145.5314 85.1188 28.4714 89.1392 42.9270 128.9595 8.2731 15.8636 13.1308 29.2710 22.1083 90.1265 164.5159 14.7643 0.1813 43.8520 2.5717 21.9279 9.9133 45.6451 25.1735 56.9415 27.1359 37.6168 14.8674 211.6999 243.6861 218.9982 47.2644 21.8890 3.4455 16.3124 0.7975 65.5814 55.6299 6.8306
temp: 298.150 k
press: 1.00000 atm
elementType: 17 8 8 8 8 7 6 6 6 6 6 1 1 1 1 1 1 1 1
symmnumber: 1
zpe: 362454.5 jmol-1
zpe.correction: 0.138052 hartree
zpe.thermalcorrener: 0.150024 hartree
zpe.thermalcorrenthalpy: 0.150968 hartree
zpe.thermalcorrgfe: 0.097303 hartree
zpe.sumelectzpe: -1010.184777 hartree
zpe.sumelectthermal: -1010.172805 hartree
zpe.sumelectthermalent: -1010.171861 hartree
zpe.sumelectthermalfe: -1010.225525 hartree
dipole: 1.0826 1.1148 -0.7474
dipole: 1.7243
quadrupole: -67.0492 -82.1079 -67.7924
quadrupole: 3.3780 -0.6115 -6.8592
quadrupole: 5.2673 -9.7914 4.5241 3.3780 -0.6115 -6.8592
hfenergy: -1010.3228288 hartree
pointgroup: C01 [X(C5H8Cl1N1O4)]
dipole: 0.2741344 -0.6119132 -0.1031644 debye
dipolederiv: -0.2680679 0.0215959 0.0363403 0.0783251 -0.2095174 -0.1404688 0.2203155 -0.1630319 -0.5594573 -0.5567833 -0.2071214 -0.0454727 -0.2935678 -0.4562071 -0.0580638 -0.0901037 -0.1035125 -0.6723489 -0.4194996 -0.2952655 -0.0246274 -0.2406132 -1.0409339 -0.2832061 -0.0197841 -0.2378899 -0.3766185 -0.7884418 -0.1599612 -0.3071874 0.1193338 -0.6831214 0.0595211 -0.4604215 -0.1409659 -0.5662926 -0.7337225 0.0847923 0.1373046 -0.1056009 -0.3961555 -0.1927239 -0.32204 -0.1503584 -0.9393137 -1.1761525 -0.0356174 -0.2622544 -0.0629491 -0.4888389 0.0429308 -0.2763424 0.0396545 -0.5290847 0.3068037 -0.0208146 -0.1038802 -0.0957485 0.0988722 -0.0652954 -0.3131555 0.0125242 0.0567966 0.3108094 0.1215354 0.0364856 0.1465705 0.2866627 0.0541444 0.0622216 0.0633312 0.5599168 0.862555 0.2479611 0.5270353 -0.0408941 1.3681002 0.1002115 0.6901999 0.2288532 0.5931564 1.4404351 -0.0919652 0.0749443 0.1971961 0.2359401 0.2503135 0.6963011 0.1738466 0.9692309 -0.084412 0.0400077 0.0878832 -0.0564756 0.2360537 0.1885376 -0.1789081 0.2079803 0.6926535 0.1474222 -0.0089014 -0.0653768 0.0138939 0.0663551 -0.0424665 0.0968659 -0.0283936 0.0275312 0.0766289 0.0660601 -0.0638978 0.0514156 -0.0507746 0.0736451 -0.032558 0.028479 0.0154892 -0.1547112 -0.000009 0.1059115 0.0202458 0.0726492 -0.0727209 0.0580322 -0.0416672 -0.0488319 0.2948894 0.0119797 -0.0550372 0.0315627 0.3134635 -0.030811 -0.0367956 -0.0131772 0.2348841 0.0718224 0.0455224 -0.0066801 0.0740105 0.0366566 -0.0059734 -0.02885 0.0203546 -0.0354202 0.0626269 -0.037837 0.0253672 -0.0770773 0.0090494 -0.0282927 0.0223092 -0.0543305 0.0025355 0.3341241 0.1228353 0.0096353 0.1935121 0.3287848 0.0813013 0.0414872 0.0554989 0.2950938 0.2736736 0.0952029 -0.1064934 0.0468602 0.2729612 0.0694173 -0.1287735 0.1028046 0.28008 unknown
polarizability: 94.9061594|-3.3014485|71.005698|6.6756026|9.6288206|83.4532086 unknown
InChI: InChI=1S/C5H8ClNO4/c6-1-4(9)7-3(2-8)5(10)11/h3,7-8,10H,1-2H2
charge 0 multiplicity 1
19 atoms
Cl -2.621534 1.288706 1.730386
O  2.085495 1.864498 1.051052
O  1.112353 -2.092356 -0.42393
O  2.658732 -0.919537 0.842915
O  -1.442712 -0.042325 -1.934939
N  -0.254709 0.555036 -0.013833
C  1.068871 0.326658 -0.605993
C  1.978058 1.554389 -0.377449
C  1.710432 -0.924824 0.017974
C  -1.408898 0.364001 -0.73307
C  -2.744005 0.661424 -0.051514
H  0.908216 0.136151 -1.684021
H  1.517556 2.440855 -0.841245
H  2.973627 1.378096 -0.831817
H  -0.289787 0.965243 0.926912
H  -3.279509 1.439194 -0.614939
H  -3.346782 -0.25759 -0.011942
H  2.619981 1.13436 1.466061
H  1.522516 -2.881878 0.025193
