program: Gaussian 09
title: 000294500
version: EM64L-G09RevD.01
frameworkgroup: C1[X(C11H11N3O)]
method: RPBEPBE
basis: SDD
operation: Freq
keyword: #p
keyword: freq=noraman
keyword: PBEPBE/SDD
title: #p freq=noraman PBEPBE/SDD
converged: NO YES NO NO
title: Mulliken charges:
elementType: O N N N C C C C C C C C C C C H H H H H H H H H H H
charge: -0.235270 -0.460729 -0.467846 -0.071224 0.188678 0.423203 0.450467 -0.436680 -0.453306 -0.314410 -0.795072 0.035164 -0.199634 -0.223077 -0.255353 0.303678 0.288389 0.251440 0.239443 0.260888 0.238681 0.209822 0.338646 0.225277 0.229833 0.228992
chargesum: 0.00000
title: Mulliken charges with hydrogens summed into heavy atoms:
elementType: O N N N C C C C C C C C C C C
charge: -0.235270 -0.157051 -0.179457 -0.071224 0.188678 0.423203 0.450467 -0.185240 -0.243483 0.024236 -0.056059 0.035164 0.025644 0.006755 -0.026361
polarizability: 2.25465573e+02 2.93414822e+00 1.64574740e+02 1.63622522e-03 7.66631347e-02 6.10036152e+01
1716.lowfreq: -3.6497 -0.0007 -0.0005 -0.0002 3.8291 7.6609 42.7738 53.2771 99.6515
frequency: 42.6111 53.2601 99.6420 100.7050 122.5254 167.1228 206.0513 236.7112 243.9479 270.3478 340.1952 409.4879 424.9993 485.2701 502.0427 516.8847 544.8599 555.8997 582.9378 606.3868 618.1331 669.3840 697.8878 700.6220 733.2245 766.1979 817.9789 842.7124 858.4075 884.0603 921.6401 973.2665 976.0965 983.7461 1000.9901 1015.2551 1027.2542 1051.6943 1057.3507 1089.0084 1154.7749 1171.8261 1187.0168 1215.1770 1222.9548 1271.1773 1322.6452 1352.0409 1389.7013 1405.1011 1417.5729 1439.4258 1465.9667 1469.9690 1484.4699 1532.9568 1565.0518 1606.1856 1614.4741 1626.1975 1660.0807 2976.7327 3051.8243 3095.7222 3117.5252 3132.2580 3144.0076 3164.8570 3182.8662 3186.3615 3526.2248 3532.2309
redmass: 4.2595 4.4564 1.5363 5.6369 1.9246 4.4982 4.3516 3.8712 3.0218 5.4026 4.4073 2.9615 1.4039 6.7982 5.3297 2.5610 3.8046 8.6851 1.2379 6.2713 6.2833 7.1015 1.9972 6.0461 4.0975 1.6888 5.3499 1.2842 1.4937 6.0739 1.3999 1.3378 2.0089 6.0713 5.0490 1.2956 2.1015 1.5209 2.2869 1.6323 3.4882 1.0548 1.1183 2.0101 2.7459 2.0193 1.4198 1.9355 6.3614 1.3119 3.0064 2.4032 1.0434 1.1855 2.3236 2.6194 3.8733 3.8192 6.3966 5.2841 6.4453 1.0394 1.0981 1.0892 1.0964 1.0865 1.0929 1.0993 1.0964 1.0936 1.0769 1.0766
irintensity: 3.1270 0.1185 0.0611 5.1129 0.2746 0.0251 0.4864 1.4037 1.7649 0.3129 3.7847 0.0040 0.0618 0.3128 1.4889 46.5546 0.2616 1.2018 136.6089 1.0313 6.2061 5.4448 44.0806 13.0359 3.0455 91.6586 0.1159 0.0071 35.4978 7.4947 11.8965 0.2392 0.5085 0.8749 7.8807 4.5669 16.4378 8.6980 0.7607 10.8051 26.3987 0.5230 0.8781 85.5139 112.1845 32.1459 65.1511 32.9128 53.9061 20.0163 69.0332 112.2928 18.5129 18.5380 77.8158 724.1929 415.7732 22.1288 165.4848 145.4841 260.9788 26.4464 16.8325 20.2018 9.7396 0.5837 29.8013 19.9603 28.7912 3.6145 6.5121 35.1092
temp: 298.150 k
press: 1.00000 atm
elementType: 8 7 7 7 6 6 6 6 6 6 6 6 6 6 6 1 1 1 1 1 1 1 1 1 1 1
symmnumber: 1
zpe: 531633.5 jmol-1
zpe.correction: 0.202488 hartree
zpe.thermalcorrener: 0.215613 hartree
zpe.thermalcorrenthalpy: 0.216558 hartree
zpe.thermalcorrgfe: 0.162101 hartree
zpe.sumelectzpe: -664.194987 hartree
zpe.sumelectthermal: -664.181862 hartree
zpe.sumelectthermalent: -664.180918 hartree
zpe.sumelectthermalfe: -664.235374 hartree
dipole: 0.8108 -9.1186 0.0097
dipole: 9.1546
quadrupole: -71.2882 -87.7990 -92.6865
quadrupole: -16.0325 0.0406 0.0493
quadrupole: 12.6363 -3.8744 -8.7619 -16.0325 0.0406 0.0493
hfenergy: -664.3974755 hartree
pointgroup: C01 [X(C11H11N3O1)]
dipole: -0.234932 3.4942914 -0.8407827 debye
dipolederiv: -0.613727 -0.0770993 0.033821 -0.3425693 -1.1920775 0.2197884 0.0989861 0.2040325 -0.4380729 -1.4460294 -0.1311202 0.1083058 0.4110148 -0.6462336 0.0684509 -0.0240755 0.1028288 -0.2838317 -2.1835639 -0.0946831 0.1401463 -0.29844 -0.3110802 0.0074588 0.1902366 -0.0060437 -0.3645341 -1.2600771 -0.4180729 0.1657557 -0.9361213 -0.9338377 0.2216398 0.2933698 0.1886365 -0.3388708 2.3334075 0.0964792 -0.1589353 0.7890776 1.0867974 -0.2605463 -0.3320614 -0.2168551 0.3025984 0.8516494 0.2782643 -0.1227913 0.0547384 0.6880565 -0.169297 -0.0698588 -0.1821485 0.0539527 1.3961263 -0.1479221 -0.0467316 -0.6333622 0.0938433 0.040622 0.0724658 0.0095255 0.0875125 -0.3983431 0.3237399 -0.0666159 0.1332926 -0.6560982 0.1024525 -0.0201317 0.0902178 -0.2212409 -0.361569 0.0431863 -0.0018985 -0.0811719 0.0506231 -0.0629001 0.0296042 -0.0709589 -0.2059149 -0.3064598 0.0257601 0.0038231 0.2826066 -0.1195902 -0.0255747 -0.0597622 -0.0085993 -0.1430334 -0.1144778 0.0350561 0.0042428 0.1276023 -0.0446782 0.0226193 -0.0164288 0.0264631 0.0801932 1.4835246 0.1352317 -0.1138164 0.5280005 1.5500123 -0.3577516 -0.2097349 -0.3334407 0.3202526 0.1187042 0.0009234 -0.0169246 0.0945454 0.0809718 -0.0619044 -0.0407612 -0.0559228 -0.1252666 0.0911718 -0.004321 -0.0139153 -0.0922922 0.1556454 -0.0681225 0.0082459 -0.0735857 -0.1226855 -0.0911075 -0.0692525 0.0111456 -0.0536734 -0.1229003 -0.0124232 0.0071251 -0.0114625 -0.1843373 0.1649446 -0.019622 0.0148507 -0.0215208 0.1295312 0.0483633 0.0155968 0.0484066 0.3090355 0.1272063 0.0127566 0.0079637 0.0668567 0.0970769 0.0463231 -0.0041419 0.0502677 0.2881348 -0.0859075 -0.0080736 0.0183992 -0.0088093 0.1008027 0.0176327 0.0187627 0.0176029 0.1646754 0.0752374 -0.0201218 -0.052123 0.0399586 -0.0668835 -0.0925864 -0.0128017 -0.1197089 0.0225908 -0.0521882 -0.0212666 0.0155242 -0.1301864 0.0601196 0.0234511 0.0418107 0.0172247 0.1192261 0.0807335 0.0164877 0.0401334 0.0492025 0.0356899 0.079552 -0.0223136 0.1126311 -0.0853152 0.0619074 0.0941618 -0.016687 0.062532 -0.1124272 0.0662399 -0.0085368 0.064128 0.152599 0.238257 -0.0475525 0.0078525 -0.0623137 0.0881502 0.0250512 0.0117652 0.023932 0.1659133 -0.0548775 -0.097523 0.0380774 -0.1152043 0.0059552 0.0454611 0.04252 0.044344 0.1441079 0.0668732 0.0255369 -0.0009767 0.0631565 -0.0877425 0.0559642 -0.0104174 0.0582245 0.1383537 -0.1214155 0.0690463 0.001374 0.0730804 0.0702736 0.0200359 0.0005368 0.0202603 0.1639571 unknown
polarizability: 224.9352501|-0.9690386|158.5219303|-10.2579846|-24.0090886|67.5867476 unknown
InChI: InChI=1S/C11H11N3O/c1-8-7-10(15)14-11(12-8)13-9-5-3-2-4-6-9/h2-7,12-13H,1H3
charge 0 multiplicity 1
26 atoms
O  -2.358318 -2.633441 0.987725
N  -1.874698 1.296814 -0.006179
N  0.45688 1.012265 -0.087559
N  -0.918001 -0.857763 0.46015
C  -0.779738 0.415665 0.139065
C  -3.184847 0.829925 0.19233
C  1.762302 0.439343 -0.029426
C  -3.366671 -0.491479 0.526767
C  2.850267 1.309237 -0.317193
C  2.012548 -0.920475 0.294138
C  -4.286718 1.846074 0.017636
C  -2.221394 -1.413388 0.678854
C  4.174179 0.828772 -0.282013
C  3.346133 -1.383535 0.324634
C  4.431884 -0.524503 0.040221
H  -1.7339 2.277953 -0.254477
H  0.44968 2.004087 -0.334596
H  -4.370155 -0.890963 0.689256
H  -4.181411 2.68317 0.734481
H  -5.266514 1.375279 0.188143
H  -4.286359 2.271999 -1.004252
H  2.660382 2.362281 -0.568682
H  1.167055 -1.575935 0.511174
H  5.001934 1.510715 -0.506035
H  3.531856 -2.433985 0.575185
H  5.460327 -0.899714 0.067951
