program: Gaussian 09
title: 000294509
version: EM64L-G09RevD.01
frameworkgroup: C1[X(C11H12BrNO3)]
method: RPBEPBE
basis: SDD
operation: Freq
keyword: #p
keyword: freq=noraman
keyword: PBEPBE/SDD
title: #p freq=noraman PBEPBE/SDD
converged: YES YES NO NO
title: Mulliken charges:
elementType: Br O O O N C C C C C C C C C C C H H H H H H H H H H H H
charge: -0.009726 -0.266746 -0.396338 -0.240907 -0.379859 -0.518865 -0.630587 0.453533 0.367247 -0.386750 -0.404248 -0.391524 -0.230377 -0.224956 -0.238068 0.173493 0.235329 0.270401 0.310710 0.272780 0.232605 0.354741 0.286331 0.285246 0.227653 0.226246 0.229235 0.393400
chargesum: 0.00000
title: Mulliken charges with hydrogens summed into heavy atoms:
elementType: Br O O O N C C C C C C C C C C C
charge: -0.009726 -0.266746 -0.002938 -0.240907 -0.025118 -0.013134 -0.319877 0.453533 0.367247 -0.113970 -0.171643 0.180053 -0.002724 0.001290 -0.008833 0.173493
polarizability: 1.54543765e+02 -2.32037425e+01 1.67287534e+02 -1.03499783e+01 -1.11156616e+01 1.24663971e+02
1716.lowfreq: -3.6171 -0.0005 0.0003 0.0006 8.3870 9.5383 15.3226 33.7365 49.8503
frequency: 15.2713 33.6766 49.8477 56.2625 61.9554 80.6305 91.7834 125.2595 158.9230 204.1869 220.5366 238.6824 268.6706 334.1481 376.1959 405.1030 468.6574 493.3920 506.4410 536.4839 578.5799 596.4158 614.8226 617.4043 641.2659 652.1434 705.7093 737.6978 763.4531 816.4105 832.9369 859.0078 918.9222 931.6578 974.7631 982.1013 988.9496 990.1745 998.7443 1027.0550 1037.4300 1072.1706 1083.3994 1120.9721 1151.6464 1172.4879 1180.9043 1189.1118 1197.8068 1205.4841 1225.7079 1267.6401 1304.2112 1324.8116 1343.0115 1376.6254 1383.8118 1441.7376 1457.0392 1458.7864 1482.0197 1491.6250 1591.7396 1609.0901 1611.2593 1665.1762 2995.1670 3028.1002 3036.5129 3063.6452 3095.4008 3113.2961 3126.1244 3138.6126 3149.9905 3163.9971 3505.2744 3523.1903
redmass: 8.1819 4.2783 8.1415 4.7095 6.6871 6.1585 7.0301 5.0286 6.3792 4.7143 5.2591 5.7888 10.0906 3.0966 2.8148 2.8382 4.0711 1.9346 5.6315 3.3707 5.1989 4.7799 1.2045 6.2106 1.3893 3.8888 1.9625 3.3235 2.3859 3.5903 4.4631 1.2495 2.2022 1.5629 2.4335 1.4448 2.0843 4.9814 1.3333 2.2772 4.1114 2.2139 1.7623 1.8448 1.1996 1.0728 1.5213 1.1181 1.0929 2.8503 1.6593 1.5395 1.3712 1.3501 1.4013 2.5386 5.9295 2.1558 1.1102 1.1170 2.1898 2.0912 6.0438 8.2243 6.0416 8.0319 1.0603 1.0599 1.0995 1.0875 1.1029 1.0876 1.0863 1.0918 1.0958 1.1015 1.0783 1.0643
irintensity: 0.3333 0.0202 0.3279 1.1057 1.0629 3.6299 4.6230 4.1372 2.6511 4.6378 0.7147 9.7503 1.6972 2.7202 21.5594 0.0951 54.3606 57.5174 28.3048 8.7792 28.9124 21.7699 6.4250 0.3745 200.2626 25.4758 46.7498 37.4455 27.0864 11.2988 2.4551 0.5510 13.2406 15.1653 9.7845 0.5644 0.8111 0.2910 1.7521 9.6396 109.3639 134.7671 33.9422 61.4922 9.2070 0.1767 0.6385 1.4932 0.4449 0.0272 5.8261 2.7358 3.0561 12.0916 32.3259 134.4072 6.0304 8.6129 33.2083 25.7842 27.8508 214.4622 4.8070 221.3321 2.6663 154.0188 22.6749 11.6776 4.4207 6.4488 3.3062 8.3723 0.4335 20.5385 22.5465 25.0550 86.7437 39.9259
temp: 298.150 k
press: 1.00000 atm
elementType: 35 8 8 8 7 6 6 6 6 6 6 6 6 6 6 6 1 1 1 1 1 1 1 1 1 1 1 1
symmnumber: 1
zpe: 558293.2 jmol-1
zpe.correction: 0.212643 hartree
zpe.thermalcorrener: 0.228589 hartree
zpe.thermalcorrenthalpy: 0.229534 hartree
zpe.thermalcorrgfe: 0.165110 hartree
zpe.sumelectzpe: -719.098195 hartree
zpe.sumelectthermal: -719.082249 hartree
zpe.sumelectthermalent: -719.081304 hartree
zpe.sumelectthermalfe: -719.145728 hartree
dipole: -1.0163 -2.9139 -1.8907
dipole: 3.6192
quadrupole: -87.5292 -98.2351 -108.8937
quadrupole: 6.8956 -3.9487 -0.7031
quadrupole: 10.6902 -0.0158 -10.6744 6.8956 -3.9487 -0.7031
hfenergy: -719.3108379 hartree
pointgroup: C01 [X(C11H12Br1N1O3)]
dipole: -0.2603398 1.3042518 0.5085252 debye
polarizability: 157.5712918|21.755329|157.6433455|-0.233432|-23.3103913|131.2806314 unknown
InChI: InChI=1S/C11H12BrNO3/c12-9(11(16)13-7-10(14)15)6-8-4-2-1-3-5-8/h1-5,9,13-14H,6-7H2
charge 0 multiplicity 1
28 atoms
Br -1.021949 -3.328462 1.234371
O  -1.070388 -0.844732 -1.453831
O  -4.808648 2.237076 0.266428
O  -3.654648 1.419977 2.115537
N  -1.941236 -0.017193 0.527974
C  1.238635 -1.940741 -0.087018
C  -0.055974 -1.592952 0.666353
C  2.133459 -0.707905 -0.214765
C  -1.058511 -0.795786 -0.185691
C  2.029994 0.160428 -1.33261
C  3.080048 -0.40763 0.799866
C  -2.977445 0.750597 -0.15561
C  2.860876 1.299144 -1.434331
C  3.909124 0.732078 0.700777
C  3.801451 1.589894 -0.418699
C  -3.816407 1.479948 0.876131
H  1.764937 -2.735633 0.468842
H  0.960657 -2.334519 -1.079389
H  0.14935 -1.103071 1.633094
H  1.293323 -0.061552 -2.112856
H  3.178927 -1.078351 1.663313
H  -1.952775 -0.003733 1.553137
H  -3.628101 0.095173 -0.767158
H  -2.537825 1.480627 -0.861746
H  2.775911 1.957136 -2.306612
H  4.640356 0.946736 1.488327
H  4.446255 2.472202 -0.500394
H  -5.353896 2.704645 0.955562
