program: Gaussian 09
title: 000294504
version: EM64L-G09RevD.01
frameworkgroup: C1[X(C12H18N2O4)]
method: RPBEPBE
basis: SDD
operation: Freq
keyword: #p
keyword: freq=noraman
keyword: PBEPBE/SDD
title: #p freq=noraman PBEPBE/SDD
converged: YES YES NO NO
title: Mulliken charges:
elementType: O O O O N N C C C C C C C C C C C C H H H H H H H H H H H H H H H H H H
charge: -0.279237 -0.279236 -0.214779 -0.214780 -0.111736 -0.111737 -0.385359 -0.385096 -0.385090 -0.385355 0.219555 0.219554 -0.611801 -0.611804 0.254477 0.254479 -0.760990 -0.760989 0.236808 0.268243 0.272690 0.226704 0.226705 0.272689 0.268244 0.236808 0.253706 0.251886 0.251886 0.253705 0.244294 0.251800 0.268832 0.268833 0.251799 0.244294
chargesum: 0.00000
title: Mulliken charges with hydrogens summed into heavy atoms:
elementType: O O O O N N C C C C C C C C C C C C
charge: -0.279237 -0.279236 -0.214779 -0.214780 -0.111736 -0.111737 0.119691 0.114298 0.114304 0.119697 0.219555 0.219554 -0.106209 -0.106212 0.254477 0.254479 0.003935 0.003936
polarizability: 2.05692856e+02 -1.04777453e+01 1.56041059e+02 3.88288703e+00 -2.22767801e+00 1.10542339e+02
1716.lowfreq: -8.9795 0.0003 0.0006 0.0009 5.5633 10.7438 23.5906 34.2093 43.6621
frequency: 23.5906 34.2093 43.6554 53.0338 60.5926 66.8912 82.0717 83.7443 121.8065 137.4253 145.9917 150.5240 154.8184 269.9217 301.7125 304.0285 307.6596 367.9363 384.4787 422.0469 437.0735 446.4554 465.7788 468.5849 486.5692 522.2599 526.0170 529.6975 587.1514 609.3034 655.5819 659.7161 723.1871 726.3631 807.1517 807.6040 830.9877 900.2831 901.4235 911.2647 917.6386 973.4612 996.6489 997.6075 1021.1604 1023.1908 1036.9896 1047.7217 1048.1579 1091.9953 1125.0427 1140.7847 1154.3596 1196.3333 1199.5577 1207.7885 1219.0163 1242.6931 1246.4422 1262.9772 1270.4974 1278.3554 1336.8794 1348.3481 1358.8323 1363.0702 1375.2914 1375.6370 1411.2603 1414.8006 1443.8923 1443.9680 1451.3539 1451.4172 1452.1418 1453.0070 1463.3526 1466.9322 1486.4601 1487.6656 1583.1341 1584.0972 1630.3356 1630.7534 2977.1500 2979.0570 2980.4321 2980.4403 2990.8696 2994.0167 3042.8766 3042.8883 3063.7228 3063.7283 3092.8390 3092.9716 3109.2248 3109.4036 3116.0015 3116.0259 3124.8059 3124.8120
redmass: 4.2368 6.7156 4.3355 4.6542 8.0400 7.1031 3.6074 4.5619 4.1044 4.3532 1.6360 1.0540 1.8552 4.7104 2.5209 6.6239 2.6429 2.8817 2.7419 2.0654 2.4676 2.7624 4.3604 4.3231 2.7239 2.7667 3.0040 3.7446 4.3759 3.1256 2.7313 5.2126 3.0001 3.8579 3.6258 3.6158 1.5979 2.0721 1.9980 2.6412 2.2471 2.5431 1.8852 2.2603 1.8444 1.8344 1.9427 1.9351 2.3177 1.9011 1.3103 1.5527 3.9468 2.5948 1.5748 2.3217 2.4193 1.4683 1.4553 1.5175 1.6175 1.4608 1.2570 1.2778 1.3966 1.3715 1.2483 1.2505 2.5901 2.6351 1.0753 1.0720 1.0645 1.0678 1.1084 1.0957 1.0901 1.0911 1.0952 1.0856 7.6934 8.3575 7.5166 7.5415 1.0691 1.0689 1.0379 1.0380 1.0684 1.0684 1.0579 1.0579 1.0947 1.0947 1.0957 1.0960 1.0973 1.0972 1.1017 1.1018 1.1011 1.1011
irintensity: 0.1633 0.6645 0.0000 12.5474 10.6097 0.0000 0.0000 0.0000 22.8903 0.0000 2.5126 0.0000 4.3341 0.0000 5.6668 0.0000 12.9814 17.4878 0.0000 0.0000 9.2370 0.0000 10.4164 0.0000 0.0000 1.6338 0.0000 61.3722 0.0000 10.5375 3.9427 0.0000 3.1054 0.0000 0.0000 1.5726 0.0000 0.0000 31.3624 0.0000 9.4444 21.1538 0.0000 81.6982 10.7061 0.0000 16.9687 14.9612 0.0000 0.0000 27.9953 0.0000 14.9655 782.5718 0.0000 0.0000 0.0000 50.0101 0.0000 47.6485 0.0000 58.4212 0.0000 1.3741 30.8859 0.0000 177.0720 0.0051 0.0000 176.0590 69.1009 0.0000 0.0003 26.2185 36.7361 0.0002 65.1325 0.0000 32.8067 0.0004 719.5280 0.0038 0.0003 172.4292 29.3805 0.0000 4.5637 0.0517 0.0000 90.6240 0.2451 9.3712 0.4959 8.5243 12.4018 0.0081 5.8964 0.0001 0.1096 23.1624 6.1696 10.3384
temp: 298.150 k
press: 1.00000 atm
elementType: 8 8 8 8 7 7 6 6 6 6 6 6 6 6 6 6 6 6 1 1 1 1 1 1 1 1 1 1 1 1 1 1 1 1 1 1
symmnumber: 1
zpe: 766991.2 jmol-1
zpe.correction: 0.292132 hartree
zpe.thermalcorrener: 0.311243 hartree
zpe.thermalcorrenthalpy: 0.312188 hartree
zpe.thermalcorrgfe: 0.242169 hartree
zpe.sumelectzpe: -877.101027 hartree
zpe.sumelectthermal: -877.081915 hartree
zpe.sumelectthermalent: -877.080971 hartree
zpe.sumelectthermalfe: -877.150990 hartree
dipole: -0.0001 0.0000 0.0001
dipole: 0.0001
quadrupole: -99.2844 -133.8458 -100.3550
quadrupole: -3.3000 5.8668 4.2952
quadrupole: 11.8773 -22.6840 10.8067 -3.3000 5.8668 4.2952
hfenergy: -877.3931583 hartree
pointgroup: C01 [X(C12H18N2O4)]
dipole: -0.0000444 -0.0000169 0. debye
polarizability: 201.7441307|-8.4138869|120.6409148|-18.8997237|-16.7232135|149.8912094 unknown
InChI: InChI=1S/C12H18N2O4/c1-9(15)7-11(17)13-3-5-14(6-4-13)12(18)8-10(2)16/h3-8H2,1-2H3
charge 0 multiplicity 1
36 atoms
O  2.615259 0.701616 -2.325828
O  -2.60735 -0.705757 2.337298
O  4.302685 -1.17274 1.241064
O  -4.294585 1.168602 -1.229663
N  1.350075 0.129814 -0.455635
N  -1.342092 -0.133886 0.467176
C  1.068385 -0.626917 0.785152
C  0.370228 1.204684 -0.737486
C  -0.362244 -1.208755 0.749032
C  -1.060401 0.622845 -0.77361
C  2.417893 -0.056516 -1.324016
C  -2.409934 0.052422 1.335533
C  3.398337 -1.212934 -1.024483
C  -3.390413 1.208797 1.035953
C  4.422223 -0.789256 0.046353
C  -4.414204 0.785099 -0.034966
C  5.542021 0.119471 -0.424692
C  -5.533963 -0.123737 0.43596
H  1.156694 0.061451 1.64961
H  1.810657 -1.423619 0.9366
H  0.635112 1.657619 -1.70646
H  0.441979 1.980207 0.051545
H  -0.433994 -1.984283 -0.039994
H  -0.627131 -1.661686 1.718008
H  -1.802672 1.419549 -0.925053
H  -1.148707 -0.065518 -1.638072
H  3.911111 -1.408499 -1.98001
H  2.883266 -2.127364 -0.68997
H  -2.875363 2.123258 0.701494
H  -3.903265 1.404319 1.991448
H  6.279169 -0.474817 -0.999789
H  6.054469 0.582293 0.432573
H  5.1519 0.891644 -1.112737
H  -5.143834 -0.895904 1.124008
H  -6.046305 -0.586571 -0.421363
H  -6.271204 0.470469 1.011022
