program: Gaussian 09
title: 000294507
version: EM64L-G09RevD.01
frameworkgroup: C1[X(C9H15BrN2O4)]
method: RPBEPBE
basis: SDD
operation: Freq
keyword: #p
keyword: freq=noraman
keyword: PBEPBE/SDD
title: #p freq=noraman PBEPBE/SDD
converged: YES YES NO NO
title: Mulliken charges:
elementType: Br O O O O N N C C C C C C C C C H H H H H H H H H H H H H H H
charge: -0.025530 -0.260099 -0.286529 -0.451659 -0.207290 -0.362985 -0.379384 -0.016915 -0.610526 -0.689847 -0.704863 0.306956 -0.456188 0.230427 -0.385876 0.185246 0.264163 0.285195 0.241869 0.215936 0.204351 0.221937 0.201425 0.254047 0.359276 0.263345 0.268074 0.365410 0.284197 0.285991 0.399846
chargesum: 0.00000
title: Mulliken charges with hydrogens summed into heavy atoms:
elementType: Br O O O O N N C C C C C C C C C
charge: -0.025530 -0.260099 -0.286529 -0.051813 -0.207290 -0.003709 -0.013975 0.247248 -0.325331 -0.027692 -0.027453 0.306956 0.075231 0.230427 0.184313 0.185246
polarizability: 1.82349523e+02 -3.08926167e-01 1.30334999e+02 2.06127793e+00 -6.36458093e+00 1.14024549e+02
1716.lowfreq: -5.9881 0.0004 0.0004 0.0007 1.2648 4.1016 14.6724 20.1596 40.2067
frequency: 14.1775 19.4270 40.1978 42.9484 50.6277 66.2197 78.3613 98.7455 120.1336 141.9580 175.0637 194.0388 209.7364 214.4004 216.6344 239.0332 272.0294 296.5623 310.8572 359.1782 404.5531 452.3175 490.0298 542.4127 544.4038 556.1488 584.1922 616.3330 645.4059 649.7183 670.3584 735.3213 744.4630 817.2145 842.3567 911.3532 922.9871 945.7408 958.4177 977.2812 980.2385 988.2445 1070.0102 1077.7923 1103.1800 1113.1687 1135.8650 1163.4633 1190.8580 1201.4727 1212.5181 1215.2030 1228.7514 1271.2131 1299.8327 1301.7482 1317.3727 1343.6929 1357.8314 1374.7121 1394.5478 1458.9898 1462.6709 1470.0931 1471.7641 1472.6168 1478.8226 1492.0013 1501.5057 1599.6988 1625.5994 1689.5776 2974.0933 2975.9368 2978.8555 2996.0590 3015.4530 3022.0190 3035.4605 3045.5776 3066.8916 3077.0715 3093.8491 3096.8157 3458.2994 3537.0739 3539.7824
redmass: 7.0220 5.8350 7.2038 5.5218 5.0812 2.9053 5.0402 6.9043 5.0301 4.1672 2.5488 1.3671 1.6220 3.0941 4.4167 2.1839 4.3663 6.4414 4.5616 3.2544 2.4791 3.9358 1.8421 4.1190 4.6032 2.7112 5.5526 1.1503 5.4257 1.4696 1.2279 4.6791 5.3321 4.5149 2.5689 3.2461 1.2184 3.0196 1.4204 2.0274 2.9106 2.1264 3.3522 1.9956 1.5871 2.6552 2.0999 1.8894 1.9946 1.1065 1.6404 1.0818 1.6690 1.4355 1.3608 2.2646 1.5346 1.6855 1.5909 1.2074 1.2081 1.0795 1.0629 1.7753 1.0986 1.2042 1.0594 1.0523 2.2384 9.3562 6.3751 9.3615 1.0587 1.0369 1.0377 1.0602 1.1013 1.0833 1.0998 1.0876 1.0985 1.0972 1.0993 1.0991 1.0781 1.0651 1.0780
irintensity: 0.0836 0.6028 5.7784 3.2807 0.2897 0.3060 5.3679 2.3163 4.0107 0.8998 6.2093 4.0113 14.2669 2.2454 4.8965 10.7099 5.0378 10.4823 3.6054 2.8623 2.5624 17.9020 48.3391 41.2472 22.8764 0.1322 43.2239 24.3436 11.0405 214.5486 85.0433 18.7690 3.8011 19.9224 1.8596 18.2282 10.3883 62.1661 4.1145 0.7407 7.3524 0.6869 1.4950 243.9824 11.7177 2.8192 9.2443 10.6278 12.4447 0.1645 1.7052 0.0321 19.6657 10.6806 1.4899 47.9308 11.0398 17.6882 2.8436 17.6645 22.6233 15.3261 12.2174 339.0266 127.5493 233.3291 21.3033 34.9542 175.7048 243.6538 100.2500 263.0624 33.7402 19.8531 38.7101 20.6630 11.7664 1.4856 3.8120 6.3328 2.6516 75.4597 19.6086 26.4987 139.9675 18.6393 109.8495
temp: 298.150 k
press: 1.00000 atm
elementType: 35 8 8 8 8 7 7 6 6 6 6 6 6 6 6 6 1 1 1 1 1 1 1 1 1 1 1 1 1 1 1
symmnumber: 1
zpe: 634915.8 jmol-1
zpe.correction: 0.241827 hartree
zpe.thermalcorrener: 0.260701 hartree
zpe.thermalcorrenthalpy: 0.261645 hartree
zpe.thermalcorrgfe: 0.190021 hartree
zpe.sumelectzpe: -774.600800 hartree
zpe.sumelectthermal: -774.581926 hartree
zpe.sumelectthermalent: -774.580982 hartree
zpe.sumelectthermalfe: -774.652606 hartree
dipole: -3.2822 2.4405 -0.2909
dipole: 4.1005
quadrupole: -96.9532 -106.5235 -108.8623
quadrupole: -4.3547 21.5819 3.9622
quadrupole: 7.1598 -2.4105 -4.7493 -4.3547 21.5819 3.9622
hfenergy: -774.842627 hartree
pointgroup: C01 [X(C9H15Br1N2O4)]
dipole: -1.3203423 -0.7748622 0.5087582 debye
polarizability: 181.9582918|-3.8297425|123.6524441|-4.1812503|-10.0501098|121.0983348 unknown
InChI: InChI=1S/C9H15BrN2O4/c1-5(2)8(10)9(16)12-3-6(13)11-4-7(14)15/h5,8,11-12,14H,3-4H2,1-2H3
charge 0 multiplicity 1
31 atoms
Br 3.570727 1.97826 -0.702507
O  1.896594 -0.178155 1.639309
O  -1.52379 0.488695 -1.818882
O  -5.295535 0.70186 1.226513
O  -6.596479 1.049044 -0.673509
N  0.628629 0.086087 -0.2826
N  -3.019682 0.504581 -0.045952
C  4.240579 -0.859073 0.017575
C  3.070909 -0.022704 -0.527825
C  5.520057 -0.733709 -0.836813
C  3.784609 -2.345534 0.089914
C  1.828018 -0.041923 0.377901
C  -0.631177 0.154769 0.447834
C  -1.756369 0.395607 -0.571542
C  -4.17129 0.744223 -0.918401
C  -5.480828 0.852002 -0.158152
H  4.440145 -0.510844 1.048262
H  2.827875 -0.295852 -1.570608
H  5.899701 0.301611 -0.855531
H  6.312283 -1.38298 -0.42216
H  5.33517 -1.051641 -1.881363
H  4.612386 -2.962398 0.483403
H  3.523714 -2.734587 -0.913428
H  2.918359 -2.472184 0.760669
H  0.554988 0.235822 -1.297297
H  -0.809762 -0.782693 1.011315
H  -0.600355 0.969523 1.199029
H  -3.194465 0.4371 0.959707
H  -4.274384 -0.063149 -1.669139
H  -4.035502 1.673664 -1.504959
H  -6.166426 0.778679 1.700138
