program: Gaussian 09
title: 000294478
version: EM64L-G09RevD.01
frameworkgroup: C1[X(C9H7NO3)]
method: RPBEPBE
basis: SDD
operation: Freq
keyword: #pfreq=noraman
keyword: PBEPBE/SDD
title: #p freq=noraman PBEPBE/SDD
converged: NO NO NO NO
title: Mulliken charges:
elementType: O O O N C C C C C C C C C H H H H H H H
charge: -0.225200 -0.180448 -0.202886 -0.456407 0.097894 0.390543 0.463590 -0.527493 -0.386884 -0.314382 0.147741 -0.802152 0.186084 0.278187 0.237461 0.242081 0.345209 0.235882 0.235613 0.235564
chargesum: 0.00000
title: Mulliken charges with hydrogens summed into heavy atoms:
elementType: O O O N C C C C C C C C C
charge: -0.225200 -0.180448 -0.202886 -0.111198 0.097894 0.390543 0.463590 -0.249305 -0.149422 -0.072301 0.147741 -0.095093 0.186084
polarizability: 1.72798864e+02 2.63954683e+00 1.24864619e+02 2.82099684e-03 4.03304953e-05 4.92937075e+01
1716.lowfreq: -0.0007 0.0003 0.0008 1.4676 2.8661 9.3818 59.2999 72.1710 134.1124
frequency: 59.1781 72.1569 134.0949 154.1502 176.3139 208.2622 340.5249 344.8029 353.0427 400.5686 426.4209 452.4101 531.1876 532.7884 580.8092 631.4069 632.4275 670.7165 705.6127 711.2796 756.3895 801.9993 827.7355 870.1352 900.9964 924.7607 956.7851 971.5903 1013.4924 1052.3665 1119.0909 1150.9145 1203.2732 1237.6372 1280.3175 1294.8201 1379.5757 1403.6994 1417.0602 1446.6230 1471.6049 1484.2659 1509.0001 1597.0592 1635.2161 1676.4060 1718.6290 2981.7797 3059.6396 3094.7631 3126.7174 3148.3178 3152.9643 3551.5300
redmass: 1.2947 2.7526 11.7242 5.2713 4.1554 4.5009 8.0488 4.0480 4.6393 6.8457 3.7478 7.8608 8.4619 3.0915 6.9749 6.9373 1.5376 5.2413 6.9268 3.2719 4.9060 6.7221 1.4246 10.3535 5.8058 1.3651 2.8833 1.3609 1.6542 1.5445 3.0584 1.6369 2.4578 2.3129 2.3601 1.7673 3.6208 1.2269 3.6103 1.9057 1.0448 1.2478 3.7554 6.3182 6.8397 9.8983 9.8024 1.0378 1.0977 1.0987 1.0877 1.0962 1.0936 1.0774
irintensity: 0.0175 0.6142 0.1529 2.1600 3.0164 5.1946 5.5980 0.0882 1.4982 12.5666 0.1677 2.4923 2.2525 31.1071 3.2646 20.5766 34.8016 8.8767 2.4063 68.9755 4.2155 19.7377 62.6916 136.6770 40.6350 1.7241 34.6175 2.6821 10.9225 12.0053 22.7282 9.3094 95.4389 3.5743 14.8284 106.6689 22.6301 8.7912 24.5605 10.1668 15.0048 10.1527 174.4743 15.4510 47.2314 627.0489 538.3935 28.4006 17.2675 13.0787 9.0643 11.3726 4.9232 55.3954
temp: 298.150 k
press: 1.00000 atm
elementType: 8 8 8 7 6 6 6 6 6 6 6 6 6 1 1 1 1 1 1 1
symmnumber: 1
zpe: 378829.3 jmol-1
zpe.correction: 0.144288 hartree
zpe.thermalcorrener: 0.155042 hartree
zpe.thermalcorrenthalpy: 0.155986 hartree
zpe.thermalcorrgfe: 0.107338 hartree
zpe.sumelectzpe: -626.701358 hartree
zpe.sumelectthermal: -626.690604 hartree
zpe.sumelectthermalent: -626.689660 hartree
zpe.sumelectthermalfe: -626.738308 hartree
dipole: 6.8314 -4.8371 0.0000
dipole: 8.3705
quadrupole: -84.2032 -73.7357 -75.3644
quadrupole: 3.8962 0.0024 0.0030
quadrupole: -6.4354 4.0320 2.4034 3.8962 0.0024 0.0030
hfenergy: -626.8456462 hartree
pointgroup: C01 [X(C9H7N1O3)]
dipole: 2.7423167 1.8211825 0.090892 debye
dipolederiv: -1.0228623 0.5542753 0.0154848 0.5835598 -1.0560993 -0.0268802 0.0167064 -0.0270469 -0.2478563 -0.5165434 -0.0015184 -0.001576 -0.0967786 -1.2523514 -0.0368963 -0.0053019 -0.0359292 -0.316609 -1.5426483 0.250359 0.0006856 0.402506 -0.579085 -0.005334 0.0068005 -0.0065858 -0.3621136 -1.5763296 0.1880242 -0.0021888 -0.2895346 -0.3931639 -0.00539 -0.0208481 -0.001965 -0.3108728 -0.5497208 -0.396415 -0.0192812 -0.0930803 -0.405558 -0.0156167 -0.0075077 -0.0178911 -0.0204163 1.0869777 -0.3882851 -0.0078592 -0.1196434 0.172853 0.0017135 0.0024381 -0.0003104 0.1051925 0.3741607 -0.2246187 -0.005524 -0.1612147 -0.3259248 -0.0118414 -0.0032448 -0.012265 -0.0509143 0.0214395 0.3208717 0.0132691 -0.1525593 0.1003954 0.006576 -0.0049784 0.0101276 -0.098377 -0.4510521 0.163055 0.0043094 -0.1372434 0.1337645 0.0112593 -0.0072821 0.0135016 -0.1827748 0.0825984 -0.069285 -0.0012041 0.1425683 0.2351278 0.0148475 0.0069955 0.0132491 -0.121246 1.5249842 -0.1008021 0.0053474 0.1104396 1.7574703 0.056284 0.0135305 0.05452 0.3192439 -0.1651849 0.0455673 0.0000427 -0.0274013 0.0710966 -0.0000372 -0.0024144 0.0004479 0.06677 2.4287643 -0.2373197 0.0065235 -0.1708804 1.3542195 0.0368774 0.0090133 0.0364988 0.3719097 0.1044655 0.0101095 0.0000497 0.0536812 0.0036426 -0.005208 0.0017048 -0.0055085 0.1484103 0.0573088 0.0759116 0.0020961 0.0400156 -0.0762576 -0.0092521 0.0007443 -0.0089904 0.1704885 -0.0280068 -0.1007777 -0.0051746 -0.0935389 0.0294456 -0.0051108 -0.0049376 -0.0052026 0.1436407 0.1532109 -0.0504879 -0.0033847 -0.0383626 0.2044654 -0.0056198 -0.0029094 -0.0056848 0.3415556 0.072816 -0.0491922 -0.0021513 0.0698006 -0.1180413 -0.0081594 0.0022705 -0.0090743 0.113361 -0.0286652 0.0022823 0.0704283 -0.0164658 0.0670502 0.0883863 0.1255148 0.0525434 -0.0282917 -0.0257127 0.008246 -0.0698926 -0.0058678 0.0769502 -0.0805983 -0.1262944 -0.0444345 -0.0411004 unknown
polarizability: 172.5957441|-4.0742061|124.9502484|0.7628089|2.893138|49.4111981 unknown
InChI: InChI=1S/C9H7NO3/c1-5-2-3-7-6(4-5)8(11)13-9(12)10-7/h2-4,10H,1H3
charge 0 multiplicity 1
20 atoms
O  -2.276623 -0.844291 -0.06298
O  -0.87549 -2.675824 -0.122554
O  -3.715972 0.969505 -0.003413
N  -1.418027 1.365209 0.029557
C  0.175609 -0.479081 -0.030126
C  -0.087929 0.917237 0.021948
C  2.603301 -0.054385 0.004337
C  1.515608 -0.947627 -0.038235
C  0.996187 1.829355 0.065219
C  2.313628 1.341997 0.056116
C  -0.938005 -1.439974 -0.075755
C  4.039186 -0.544921 -0.003832
C  -2.548169 0.543041 -0.011192
H  1.676296 -2.030493 -0.078876
H  0.806016 2.907992 0.105506
H  3.144523 2.056941 0.089946
H  -1.617071 2.367038 0.067029
H  4.088901 -1.645624 -0.044676
H  4.593185 -0.149039 -0.875384
H  4.580544 -0.215654 0.902664
