program: Gaussian 09
title: 000294493
version: EM64L-G09RevD.01
frameworkgroup: C1[X(C13H17NO5)]
method: RPBEPBE
basis: SDD
operation: Freq
keyword: #p
keyword: freq=noraman
keyword: PBEPBE/SDD
title: #p freq=noraman PBEPBE/SDD
converged: YES YES NO NO
title: Mulliken charges:
elementType: O O O O O N C C C C C C C C C C C C C H H H H H H H H H H H H H H H H H
charge: -0.309440 -0.303196 -0.292785 -0.254745 -0.249475 -0.472981 0.601437 0.011499 0.331850 0.310865 -0.555527 -0.686950 0.181228 -0.623151 0.282929 -0.523883 -0.766314 -0.527323 -0.525453 0.327993 0.261568 0.370298 0.271075 0.264996 0.251358 0.262306 0.244763 0.254412 0.224735 0.231720 0.251416 0.228215 0.222089 0.213462 0.227683 0.263329
chargesum: 0.00000
title: Mulliken charges with hydrogens summed into heavy atoms:
elementType: O O O O O N C C C C C C C C C C C C C
charge: -0.309440 -0.303196 -0.292785 -0.254745 -0.249475 -0.102684 0.601437 0.011499 0.331850 0.310865 -0.227534 -0.425383 0.181228 -0.087080 0.282929 0.186984 -0.007887 0.174396 0.179020
polarizability: 2.53856748e+02 -8.39070299e+00 1.80672332e+02 -2.76388891e+00 -2.26054014e-01 1.01157282e+02
1716.lowfreq: -9.3836 -6.5486 -0.0008 -0.0007 -0.0006 4.3835 24.7916 37.7591 53.1001
frequency: 24.5377 37.7398 52.9692 60.1011 69.9125 77.4077 88.4641 90.4799 101.1215 147.3001 151.0684 156.4044 158.7950 168.1760 176.6743 208.4391 237.3797 258.4435 270.7999 293.8584 295.7401 326.7758 360.9909 372.2407 426.1850 453.8745 479.6554 495.1120 531.5689 558.4199 579.6342 599.1707 642.8772 657.0826 687.3255 765.5254 768.9672 815.5082 844.5708 869.7868 874.5953 901.6119 912.5898 919.5864 932.2499 942.0246 977.0379 1021.2276 1023.4208 1039.8691 1110.3106 1111.2397 1112.3158 1118.3485 1149.7082 1154.6544 1159.0140 1163.8769 1179.1119 1187.9726 1209.1877 1229.4698 1310.7963 1324.2371 1360.2589 1375.7775 1399.1571 1417.1964 1417.6393 1433.7958 1434.0573 1441.1505 1452.2991 1455.0722 1458.1036 1459.7587 1469.7899 1476.9347 1483.9818 1487.0799 1540.2497 1587.0409 1604.3287 1612.4792 1641.6376 2970.4748 2972.8464 2973.5817 2975.9830 2982.2886 3064.2872 3068.3854 3076.5470 3078.8753 3084.0885 3118.4800 3119.3889 3124.7753 3127.6921 3151.8940 3202.8969 3300.9714
redmass: 4.0439 4.4051 3.5457 3.3655 3.6496 2.8121 3.7542 3.1384 3.2906 1.3818 1.2743 2.3708 1.4424 1.1293 2.3866 3.1212 4.6974 5.4576 5.5237 5.0056 5.2385 4.7894 4.0260 5.0628 6.4743 2.6759 5.8995 4.5293 5.2794 3.8625 4.8794 4.9770 4.6045 3.4611 5.2576 4.6057 3.8661 2.0812 1.8158 4.5413 2.3975 1.3921 3.6967 1.6957 5.2983 7.2170 2.0489 3.1075 1.8962 5.7985 1.2429 1.2405 1.2825 3.0352 1.3661 1.4123 1.4447 1.4738 2.2440 1.8698 1.4421 3.3572 1.8804 4.5151 6.2823 1.2504 2.4506 1.1284 1.1855 1.5120 1.2588 1.0756 1.0541 1.1149 1.0570 1.0847 2.4852 1.0890 1.0575 1.0574 2.9470 4.0254 7.3668 6.7944 3.3403 1.0309 1.0333 1.0668 1.0296 1.0388 1.0954 1.1039 1.1053 1.0996 1.0913 1.1033 1.1026 1.1042 1.1003 1.0922 1.0929 1.0807
irintensity: 1.6807 2.3371 5.3125 2.0189 5.3841 2.8699 4.6637 5.6449 14.4204 1.3741 2.6583 2.0602 1.8596 0.0640 1.4533 7.9026 8.7402 0.6026 5.6667 7.9039 11.3781 2.1039 2.3179 6.6033 4.4299 2.4994 2.0585 29.8718 23.8757 4.4444 5.5494 5.2568 6.7123 7.7889 10.9588 4.5210 5.5011 10.1099 10.7120 7.4918 22.4183 47.9037 6.8259 64.3779 50.5222 51.8572 47.9039 52.1953 14.0647 161.6568 6.7908 9.7616 6.4423 21.4459 2.0409 10.7429 11.5932 31.6438 9.1844 22.5031 25.2919 272.9474 81.1652 103.7086 31.1012 80.8605 63.9727 47.3040 6.6856 13.4180 37.6145 19.8474 20.6205 28.4350 22.5873 8.6177 147.0847 3.3751 26.8622 32.1492 339.5742 375.2100 79.9335 93.8381 150.6669 68.9605 109.0668 1.9496 55.4556 1.2259 8.0535 26.7750 20.1573 32.9412 7.3654 26.9012 25.7970 17.1521 10.5227 2.0221 11.9592 314.3791
temp: 298.150 k
press: 1.00000 atm
elementType: 8 8 8 8 8 7 6 6 6 6 6 6 6 6 6 6 6 6 6 1 1 1 1 1 1 1 1 1 1 1 1 1 1 1 1 1
symmnumber: 1
zpe: 740648.7 jmol-1
zpe.correction: 0.282098 hartree
zpe.thermalcorrener: 0.303136 hartree
zpe.thermalcorrenthalpy: 0.304080 hartree
zpe.thermalcorrgfe: 0.230639 hartree
zpe.sumelectzpe: -934.972849 hartree
zpe.sumelectthermal: -934.951811 hartree
zpe.sumelectthermalent: -934.950867 hartree
zpe.sumelectthermalfe: -935.024309 hartree
dipole: 1.5716 0.9087 -1.0269
dipole: 2.0857
quadrupole: -68.1066 -123.8080 -107.4002
quadrupole: 0.8318 1.0087 -0.3633
quadrupole: 31.6650 -24.0364 -7.6286 0.8318 1.0087 -0.3633
hfenergy: -935.2549473 hartree
pointgroup: C01 [X(C13H17N1O5)]
dipole: 0.556372 -0.4459811 0.4060646 debye
polarizability: 252.3615726|2.3465176|178.5882417|18.6510063|10.4432712|104.7365484 unknown
InChI: InChI=1S/C13H17NO5/c1-8(15)5-12(16)14-9-6-10(17-2)13(19-4)11(7-9)18-3/h6-7,14H,5H2,1-4H3
charge 0 multiplicity 1
36 atoms
O  -3.710913 -0.038197 -0.673438
O  -2.267528 2.402486 -0.16583
O  -2.217731 -2.529888 -0.603514
O  2.498776 2.073111 0.645816
O  3.98577 -1.913478 0.040736
N  1.872528 -0.184188 0.369445
C  0.470928 -0.084286 0.141547
C  -2.32762 -0.055045 -0.362319
C  -1.614981 1.148941 -0.1023
C  -1.620155 -1.289335 -0.313539
C  -0.226786 1.150423 0.136352
C  -0.232289 -1.298717 -0.064537
C  2.774611 0.836661 0.596506
C  4.233605 0.379652 0.859686
C  4.738039 -0.90646 0.203695
C  -4.000806 0.502123 -2.025655
C  6.189455 -0.928215 -0.232789
C  -3.335724 2.60318 0.840179
C  -3.435875 -2.880579 0.160315
H  0.294602 2.09253 0.308777
H  0.281784 -2.26555 -0.049743
H  2.29575 -1.128191 0.31539
H  4.329321 0.239896 1.958348
H  4.883595 1.232237 0.603227
H  6.324166 -0.25066 -1.098622
H  6.490108 -1.946394 -0.522585
H  6.849448 -0.551215 0.570375
H  -3.627146 1.538188 -2.112266
H  -5.09712 0.478619 -2.1248
H  -3.535238 -0.138636 -2.797083
H  -4.117273 1.828167 0.746568
H  -3.751274 3.600083 0.627741
H  -2.903277 2.586155 1.858727
H  -3.194421 -2.972977 1.237002
H  -3.748976 -3.858208 -0.23698
H  -4.224855 -2.125336 0.011067
