program: Gaussian 09
title: 000294451
version: EM64L-G09RevD.01
frameworkgroup: C1[X(C10H14N2O2)]
method: RPBEPBE
basis: SDD
operation: Freq
keyword: #p
keyword: freq=noraman
keyword: PBEPBE/SDD
title: #p freq=noraman PBEPBE/SDD
converged: YES YES NO NO
title: Mulliken charges:
elementType: O O N N C C C C C C C C C C H H H H H H H H H H H H H H
charge: -0.283028 -0.283068 -0.379697 -0.379789 -0.422666 -0.422116 0.261135 0.261147 -0.284847 -0.284698 -0.046615 -0.047508 -0.564819 -0.564474 0.261824 0.224196 0.261800 0.224259 0.303838 0.303925 0.251347 0.251319 0.239798 0.239806 0.221732 0.217688 0.221768 0.217743
chargesum: 0.00000
title: Mulliken charges with hydrogens summed into heavy atoms:
elementType: O O N N C C C C C C C C C C
charge: -0.283028 -0.283068 -0.075859 -0.075864 0.063354 0.063943 0.261135 0.261147 -0.033500 -0.033379 0.193184 0.192298 -0.125400 -0.124963
polarizability: 2.56005706e+02 -3.01242427e+01 1.06060574e+02 -1.12247319e-01 1.21312872e-02 8.07967965e+01
1716.lowfreq: -1.1712 0.0003 0.0006 0.0007 1.7143 8.6037 16.6577 40.5791 45.7383
frequency: 16.6272 40.3985 45.5467 52.2993 68.9316 83.3095 91.1793 105.2651 179.4491 194.4701 207.2230 248.9818 260.7190 302.7706 348.2979 360.8081 398.3365 462.3423 526.2073 578.2909 592.9733 635.1406 637.2001 652.6149 664.9765 732.7301 738.7006 876.2959 901.1313 910.4633 920.5733 928.7120 954.1839 954.6664 993.2154 995.4160 998.9267 1014.2858 1015.7331 1044.3303 1073.3397 1141.6444 1142.1328 1174.8969 1198.4143 1237.5413 1241.0617 1281.1348 1281.3013 1291.9904 1307.4406 1335.1462 1337.0196 1426.8287 1426.9227 1466.0427 1466.5829 1480.3985 1480.5017 1588.4260 1593.9373 1656.6818 1656.7905 1669.7293 2983.6876 2984.1633 3045.7488 3046.0668 3088.6537 3088.7705 3108.6694 3108.7054 3112.8721 3115.8536 3200.4082 3200.5474 3544.5349 3544.7858
redmass: 4.3276 5.0222 3.6993 3.2980 4.4892 2.8133 2.4838 3.7542 4.0971 2.2673 4.7575 4.7299 4.5951 6.9703 2.5114 2.5941 2.4167 1.9135 2.4444 1.3655 1.1288 4.5899 2.4213 1.6919 2.0127 9.4720 4.2969 2.0686 1.4975 2.2167 2.1063 2.6365 1.3288 1.3439 1.0857 1.4955 1.4133 1.6321 1.8032 4.8656 3.3200 1.9310 1.9677 1.5294 1.9033 1.2047 1.2339 1.2515 1.2415 1.7265 1.4282 1.3470 1.3990 1.1986 1.1975 1.1409 1.1451 1.8050 1.7587 6.7380 7.1700 4.6084 4.6101 6.3855 1.0602 1.0601 1.1005 1.1006 1.0602 1.0602 1.0948 1.0948 1.0960 1.0873 1.1142 1.1142 1.0780 1.0779
irintensity: 1.3850 0.6194 0.6707 1.3325 6.5133 8.0026 0.3311 8.6167 5.8551 1.1965 1.5365 3.6319 26.9244 0.0330 8.0614 2.8985 12.8301 0.1373 1.5255 8.9349 224.8105 22.1712 1.2665 6.3648 23.6077 9.0366 1.4382 19.4234 6.3966 0.0677 1.3834 2.5562 166.8786 1.5572 70.7351 20.4680 1.7110 55.8325 0.9435 0.3056 10.2483 5.6423 0.1286 88.3722 0.0889 104.9499 0.9539 2.6180 0.4143 249.1615 0.0278 0.0211 53.9752 31.6062 6.3161 55.5729 59.5207 467.2650 9.9681 263.3549 0.0842 20.5898 16.8245 0.0141 54.8052 37.1408 8.6658 8.8801 12.0552 11.8778 3.3305 16.7601 0.0102 3.2594 20.9895 28.1913 58.7951 0.4495
temp: 298.150 k
press: 1.00000 atm
elementType: 8 8 7 7 6 6 6 6 6 6 6 6 6 6 1 1 1 1 1 1 1 1 1 1 1 1 1 1
symmnumber: 1
zpe: 591332.6 jmol-1
zpe.correction: 0.225227 hartree
zpe.thermalcorrener: 0.240997 hartree
zpe.thermalcorrenthalpy: 0.241941 hartree
zpe.thermalcorrgfe: 0.178996 hartree
zpe.sumelectzpe: -648.316733 hartree
zpe.sumelectthermal: -648.300963 hartree
zpe.sumelectthermalent: -648.300019 hartree
zpe.sumelectthermalfe: -648.362963 hartree
dipole: 0.0013 -0.0019 0.0632
dipole: 0.0632
quadrupole: -59.3626 -93.9057 -81.4838
quadrupole: -16.7726 -0.0072 -0.0464
quadrupole: 18.8881 -15.6550 -3.2331 -16.7726 -0.0072 -0.0464
hfenergy: -648.5419593 hartree
pointgroup: C01 [X(C10H14N2O2)]
dipole: -0.0005162 -0.0248368 0.0012743 debye
polarizability: 256.9539706|-0.6570587|80.8077686|-27.6398841|0.5173895|105.1013373 unknown
InChI: InChI=1S/C10H14N2O2/c1-3-7-11-9(13)5-6-10(14)12-8-4-2/h3-6,11-12H,1-2,7-8H2
charge 0 multiplicity 1
28 atoms
O  1.827336 0.275726 1.829132
O  -1.82707 0.189585 -1.845177
N  3.039513 0.25787 -0.167085
N  -3.038303 0.258682 0.150494
C  4.362642 0.249567 0.483612
C  -4.361819 0.219135 -0.49824
C  1.852699 0.261398 0.556397
C  -1.851838 0.233111 -0.573085
C  0.6196 0.24511 -0.288405
C  -0.618496 0.25605 0.271194
C  5.213071 -0.91308 0.011995
C  -5.214641 -0.914586 0.035276
C  6.445486 -0.783991 -0.539827
C  -6.44553 -0.752745 0.58181
H  4.157384 0.179537 1.568775
H  4.888072 1.206928 0.299124
H  -4.157535 0.091273 -1.578308
H  -4.884788 1.186335 -0.364819
H  3.003922 0.237509 -1.18835
H  -3.00222 0.284641 1.171617
H  0.701729 0.222195 -1.384052
H  -0.700473 0.280572 1.366819
H  4.772021 -1.910615 0.152406
H  -4.776794 -1.919473 -0.053071
H  7.032047 -1.656883 -0.84615
H  6.907383 0.200274 -0.69058
H  -7.034254 -1.606369 0.93469
H  -6.903842 0.239646 0.68141
