program: Gaussian 09
title: 000027288
version: EM64L-G09RevD.01
frameworkgroup: C1[X(C10H13ClOS)]
method: RPBEPBE
basis: SDD
operation: Freq
keyword: #p
keyword: freq=noraman
keyword: PBEPBE/SDD
title: #p freq=noraman PBEPBE/SDD
converged: YES YES NO NO
title: Mulliken charges:
elementType: Cl S O C C C C C C C C C C H H H H H H H H H H H H H
charge: -0.056386 0.182664 -0.452364 -0.331182 -0.352480 -0.661212 -0.329323 -0.184455 -0.242426 -0.194047 -0.196266 -0.206481 -0.094509 0.208106 0.209374 0.214956 0.213799 0.266976 0.255198 0.188479 0.188610 0.260930 0.252138 0.258463 0.257833 0.343606
chargesum: 0.00000
title: Mulliken charges with hydrogens summed into heavy atoms:
elementType: Cl S O C C C C C C C C C C
charge: -0.056386 0.182664 -0.108758 0.086298 0.076274 -0.139038 0.047766 -0.184455 0.018505 0.058091 0.062197 0.051351 -0.094509
polarizability: 2.16333256e+02 -1.67320395e+01 1.09334561e+02 -1.09295849e+01 -1.25942841e+01 9.76670191e+01
1716.lowfreq: -22.3346 -3.7645 -0.0017 -0.0012 0.0017 2.1629 13.7800 15.3081 31.9300
frequency: -18.8509 13.7136 31.9273 60.4216 92.6432 95.1708 128.8064 139.7814 195.4402 217.9329 278.3467 286.8183 322.7625 326.8123 372.0771 409.9229 453.1294 488.5242 515.4512 620.2686 687.5096 705.0310 716.1441 756.3104 799.5600 822.8971 828.3223 907.6986 948.5309 963.6899 966.5408 991.2276 1007.7546 1044.6187 1049.8305 1067.0378 1071.7761 1074.9812 1097.4507 1154.0181 1176.8002 1202.9713 1236.9346 1242.4774 1280.0218 1286.0986 1289.2882 1300.5601 1354.1104 1355.9001 1377.8318 1415.3031 1452.2307 1454.8912 1470.1268 1477.1591 1489.7214 1574.1952 1576.8724 2930.4137 2976.6871 2978.2609 2996.2698 3020.1505 3024.8504 3062.7667 3098.0285 3146.5112 3153.4302 3171.3544 3175.6391 3568.0566
redmass: 1.8504 4.6762 7.3761 4.3603 4.0982 2.3569 2.5409 5.3704 9.7667 7.9780 1.0800 5.9436 4.7854 13.1262 4.1545 2.9015 4.5131 3.5180 6.5333 7.1358 5.2003 4.4701 6.8512 1.0762 1.1384 1.3474 1.3460 1.2296 1.3311 1.3715 7.8021 5.6157 2.6471 4.3012 1.1631 5.4634 2.0426 2.4972 1.3591 1.2900 1.1154 1.1934 1.3296 1.2528 1.2385 1.0764 1.1455 1.2873 1.5151 4.6301 4.0384 1.4359 1.2672 1.7281 1.0713 1.0844 1.0922 6.3968 7.9512 1.0545 1.0590 1.1067 1.0588 1.0565 1.1013 1.1054 1.1092 1.0891 1.0889 1.0963 1.0976 1.0665
irintensity: 2.7884 0.1783 0.4670 4.9813 3.1005 4.1463 1.7427 1.8898 1.1868 0.7832 161.6293 1.6347 0.1997 3.1572 4.2333 0.0846 14.9965 26.8603 33.9511 0.0560 3.8253 0.3778 10.1093 9.8050 0.1709 31.9073 33.8610 0.3985 0.2056 0.3168 62.6921 76.5602 48.7363 5.8534 0.9268 20.8091 23.6463 4.7731 9.2352 0.8676 0.3299 28.5705 0.3435 3.7471 1.2784 2.2954 0.4874 46.0344 1.8038 0.8083 6.1239 8.6508 9.8425 83.3044 1.2713 3.9957 9.5366 6.7403 0.9569 65.9407 16.5055 51.6986 30.9306 26.7230 2.6809 51.3715 35.2751 3.6516 1.8179 6.0264 1.0839 2.4036
temp: 298.150 k
press: 1.00000 atm
elementType: 17 16 8 6 6 6 6 6 6 6 6 6 6 1 1 1 1 1 1 1 1 1 1 1 1 1
symmnumber: 1
zpe: 538479.8 jmol-1
zpe.correction: 0.205096 hartree
zpe.thermalcorrener: 0.218895 hartree
zpe.thermalcorrenthalpy: 0.219839 hartree
zpe.thermalcorrgfe: 0.161244 hartree
zpe.sumelectzpe: -1321.199963 hartree
zpe.sumelectthermal: -1321.186164 hartree
zpe.sumelectthermalent: -1321.185220 hartree
zpe.sumelectthermalfe: -1321.243815 hartree
dipole: -2.8503 0.7184 0.2156
dipole: 2.9473
quadrupole: -84.8908 -98.3204 -89.9089
quadrupole: -5.5902 -3.8071 -7.1123
quadrupole: 6.1492 -7.2803 1.1311 -5.5902 -3.8071 -7.1123
hfenergy: -1321.4050593 hartree
pointgroup: C01 [X(C10H13Cl1O1S1)]
dipole: -1.1082816 -0.3310387 0.0818568 debye
dipolederiv: -0.7885366 -0.2900867 0.0759395 -0.3433733 -0.2118147 0.0458081 0.0911191 0.0437675 -0.1383508 -0.397456 0.0198604 -0.0189889 0.0595231 0.0065452 -0.0429082 -0.1315767 -0.0799059 -0.1472604 -0.6341059 0.3372198 -0.0924207 0.4328244 -0.4973196 -0.0125797 -0.1189594 -0.0154654 -0.588098 -0.0856674 0.0004059 -0.008406 0.2648252 0.0629574 0.028123 -0.0710766 0.031086 0.1661989 -0.2341177 0.027236 -0.0176697 -0.1696512 0.090594 0.0116995 0.0292052 0.0144469 0.1370014 0.3196175 -0.197474 0.045307 -0.3407378 0.1189042 0.023935 0.1682832 0.0375363 0.1309127 0.6258665 -0.2494126 0.0719253 -0.1626383 0.450805 -0.0076892 0.049211 -0.0093215 0.4462739 0.5662175 0.2192484 -0.050729 0.2945516 -0.0991849 0.0054981 -0.072878 0.0253699 -0.0390366 -0.2036868 0.0112214 -0.0445309 -0.0011839 -0.0900325 -0.0433105 0.091943 -0.0073683 0.0512821 -0.1530903 0.0156878 0.08274 -0.0874162 -0.1206801 0.0279135 -0.0115392 -0.0113249 0.0381726 -0.2730241 -0.0758116 0.1169926 -0.0745638 -0.1299993 0.0405644 0.0873027 0.0260257 -0.0236325 -0.2967441 -0.0681815 -0.0308376 -0.0902571 -0.1350749 -0.0308582 0.0062976 -0.0129701 0.0110662 1.0639311 0.4943607 -0.1160641 0.5360888 0.1724603 -0.0836085 -0.1294164 -0.0827506 0.1393007 0.0732245 -0.0162179 -0.0218901 -0.0427937 -0.0750041 -0.0987829 -0.0262004 -0.1131617 -0.010074 0.067846 -0.0067034 0.0336825 -0.0300198 0.0340858 0.0723253 0.0529262 0.0882912 -0.1113544 0.0683646 -0.0342691 -0.0372368 -0.0307068 -0.0655821 -0.0983488 -0.0172624 -0.1140958 -0.0096835 0.0630542 -0.0160033 0.0604645 -0.0213971 0.0393567 0.0696019 0.0397203 0.0852593 -0.1082182 -0.0105672 0.0237739 -0.0265102 0.0602967 -0.0938741 -0.0713299 -0.0410043 -0.0782652 0.0055378 0.0061755 0.0337916 0.032831 0.0317512 -0.005651 0.0701351 0.0394672 0.0860879 -0.0841195 -0.0055675 0.0151681 -0.0312158 0.0094802 -0.1755493 -0.1037976 -0.0458643 -0.1424711 -0.0570827 -0.0113057 0.0210118 0.0295848 0.0253139 -0.0373194 0.0951352 0.0450398 0.1332857 -0.1879979 0.0918747 -0.0431607 0.0572753 -0.0366617 0.1223029 0.0422709 0.0432218 0.0321679 -0.0179467 0.0369607 -0.0475126 -0.0924328 -0.0455041 0.120739 -0.0157335 -0.0800829 -0.0114116 0.0099576 0.0308938 -0.0431039 -0.0736862 -0.0554829 0.1473871 -0.0112429 -0.0704655 -0.0090513 0.017528 0.0663027 -0.0436534 0.0438774 -0.0437648 0.1431952 0.045638 0.047027 0.0405681 -0.0152844 0.01354 -0.087395 0.011999 -0.1385028 0.2277532 0.0415419 0.0255622 0.0436709 0.3849077 unknown
polarizability: 214.3261643|25.3570296|96.0128847|0.6879021|-9.9976342|112.9957871 unknown
InChI: InChI=1S/C10H13ClOS/c11-9-3-5-10(6-4-9)13-8-2-1-7-12/h3-6,12H,1-2,7-8H2
charge 0 multiplicity 1
26 atoms
Cl 5.434025 1.270789 -0.319828
S  -0.336039 -1.54868 0.510414
O  -6.279791 1.178984 -0.43939
C  -2.969818 -0.617462 0.151526
C  -3.979385 0.507834 -0.178648
C  -1.519832 -0.11515 0.067546
C  -5.430772 0.024647 -0.099166
C  1.287265 -0.709382 0.264087
C  2.127998 -0.480767 1.379313
C  1.722435 -0.339348 -1.031655
C  3.398739 0.116679 1.207444
C  2.982442 0.27362 -1.21559
C  3.801241 0.48938 -0.08921
H  -3.106328 -1.464796 -0.549941
H  -3.164948 -1.008766 1.170248
H  -3.852091 1.354511 0.522894
H  -3.796461 0.90071 -1.197385
H  -1.330195 0.703844 0.781625
H  -1.27016 0.226053 -0.951685
H  -5.593641 -0.811635 -0.814138
H  -5.654428 -0.343334 0.926332
H  1.790094 -0.765513 2.380469
H  1.088078 -0.542316 -1.90087
H  4.052943 0.293378 2.065981
H  3.322532 0.562736 -2.214158
H  -7.232804 0.913785 -0.395818
