program: Gaussian 09
title: 000294528
version: EM64L-G09RevD.01
frameworkgroup: C1[X(C19H23N3O2)]
method: RPBEPBE
basis: SDD
operation: Freq
keyword: #p
keyword: freq=noraman
keyword: PBEPBE/SDD
title: #p freq=noraman PBEPBE/SDD
converged: YES YES NO NO
title: Mulliken charges:
elementType: O O N N N C C C C C C C C C C C C C C C C C C C H H H H H H H H H H H H H H H H H H H H H H H
charge: -0.273713 -0.322453 -0.194972 -0.450622 -0.427547 -0.349107 -0.318262 -0.364033 0.182670 0.183960 -0.704453 -0.655531 0.454993 0.469926 -0.446515 -0.444760 -0.351753 -0.349257 -0.197059 -0.196462 -0.215524 -0.212550 -0.255606 -0.252271 0.275109 0.260398 0.216587 0.209442 0.218043 0.227661 0.222091 0.205448 0.203103 0.221376 0.252179 0.377889 0.368300 0.238291 0.226158 0.302791 0.304736 0.225110 0.227508 0.223752 0.227955 0.226736 0.230238
chargesum: 0.00000
title: Mulliken charges with hydrogens summed into heavy atoms:
elementType: O O N N N C C C C C C C C C C C C C C C C C C C
charge: -0.273713 -0.322453 -0.194972 -0.072733 -0.059247 -0.073998 0.158722 0.063453 0.182670 0.183960 -0.049253 0.021127 0.454993 0.469926 -0.208223 -0.218602 -0.048962 -0.044521 0.028051 0.031046 0.008228 0.015406 -0.028870 -0.022033
polarizability: 3.41244548e+02 6.02607349e+00 2.67741828e+02 3.14689773e+00 6.23285556e+00 1.32373361e+02
1716.lowfreq: -6.5217 -0.0007 -0.0005 0.0004 2.5264 6.6295 24.2542 30.2096 36.4075
frequency: 24.1798 30.1880 36.3281 46.3942 49.0157 57.1237 74.0688 84.9384 94.7996 110.9830 127.7365 162.4383 171.5334 192.9527 211.2781 228.5749 252.8033 261.5334 277.9133 291.5775 312.6151 330.6351 348.3123 369.3852 386.0112 408.3541 408.7110 466.8051 506.8769 509.2531 528.7916 540.9318 569.7568 589.1173 611.4066 613.5220 614.0511 697.4718 698.1451 733.8622 751.2880 769.1946 770.1823 778.0632 792.2054 805.0662 832.5700 841.8115 843.6502 845.7618 889.4056 915.7167 920.7887 928.1426 943.0379 960.7199 969.4643 976.9915 979.6272 985.0563 986.1023 997.9943 1001.2659 1002.2079 1025.9361 1026.6797 1065.9325 1067.7425 1083.9413 1087.2809 1088.6896 1115.7560 1157.2954 1158.1655 1171.3209 1172.9223 1182.9326 1186.4553 1187.9209 1204.5660 1210.7810 1247.4099 1268.0947 1278.5474 1303.6639 1321.6078 1324.1489 1339.1057 1348.3981 1368.2074 1384.7881 1385.8292 1391.8682 1393.8385 1437.1366 1439.1237 1455.6623 1465.4505 1471.4621 1479.1541 1480.5684 1485.4913 1491.2945 1497.5472 1512.8742 1547.0710 1574.0207 1593.4324 1598.5984 1615.5681 1615.9920 1659.6404 2971.8417 2978.8637 2982.1393 2983.8790 2989.7951 3030.9421 3035.5519 3076.0165 3079.5940 3083.9759 3107.1267 3118.0657 3120.9522 3130.4970 3132.6675 3139.8574 3143.7047 3145.4401 3160.2438 3163.9169 3165.3494 3189.9044 3194.7500
redmass: 5.3797 4.1059 3.2233 3.4507 4.7766 3.1469 3.0191 4.9457 4.8577 3.7524 3.4211 3.2941 4.9086 2.8033 1.4786 2.2570 2.9552 4.4386 1.9214 3.4539 6.7493 2.3561 6.9236 5.4558 6.6026 2.9139 2.9298 5.0041 3.4961 3.1707 3.5694 3.5402 5.6903 4.6153 5.3827 6.4454 6.3164 1.9089 1.9271 6.0096 3.1996 1.7081 1.7255 1.2320 2.7213 1.6181 3.9952 3.4416 1.2852 1.3824 3.3754 1.3411 1.4189 2.1484 1.2959 4.9360 1.2433 1.3431 1.2688 6.1604 6.1937 1.3063 1.3339 2.2887 2.1621 2.1180 2.5847 2.3647 2.0048 1.5595 1.5669 1.7010 2.3307 2.7926 1.0752 1.0529 2.6586 1.1495 1.1631 1.7768 1.6708 2.0418 1.1906 2.3236 1.4386 1.3891 1.3485 1.3020 1.2353 1.3900 7.4650 7.4763 1.2329 1.2187 2.3581 2.3810 1.0496 1.0607 1.0533 1.4096 1.3360 2.4173 1.0895 1.1439 2.2451 2.7359 7.0878 6.2554 7.3457 6.0133 6.0111 2.3328 1.0807 1.0423 1.0538 1.0520 1.0456 1.1024 1.1018 1.0995 1.0985 1.0992 1.0999 1.0878 1.0865 1.0880 1.0871 1.0772 1.0941 1.0938 1.0864 1.0985 1.0983 1.0955 1.0949
irintensity: 0.9921 0.5114 0.2393 0.4089 0.4209 0.1720 0.7269 0.8996 0.6915 1.3578 1.4643 1.2932 6.5982 2.6740 5.4595 17.0609 2.2123 0.6881 2.5154 1.0869 10.2160 1.1818 2.8620 7.1867 19.7305 0.0616 0.0054 3.9354 20.1492 5.1816 18.9867 29.0405 35.5664 40.3521 1.6230 0.1575 1.1585 25.0430 53.9711 14.7727 5.3527 55.8551 73.6114 5.2322 4.6100 3.5072 9.3235 9.2223 1.3105 2.1181 2.5365 3.8987 3.0468 2.9173 106.4231 11.4564 44.1609 4.4030 14.7837 0.3502 0.6324 2.9588 4.0644 8.7586 4.2220 9.5886 8.5038 60.7734 13.3128 29.0171 1.1138 10.2513 30.3060 12.3089 1.2623 0.5272 11.7663 1.3716 2.4639 12.9602 2.9551 13.4320 1.2254 13.0899 32.4666 24.0886 13.3345 6.7740 13.2259 16.1037 30.7613 3.8568 27.6719 25.1435 113.4565 41.0168 8.0994 20.8472 3.7151 14.7211 12.9802 98.1401 26.0661 33.9389 601.1139 913.7826 82.1597 39.9500 259.3656 41.1129 7.5444 59.4408 4.1929 17.3978 54.2679 19.5441 32.3939 8.5480 28.8986 66.2978 53.6425 28.4977 31.7662 8.6456 5.3631 2.6347 3.4850 176.7608 21.1908 38.1611 869.9668 69.0388 14.8253 5.7502 4.7567
temp: 298.150 k
press: 1.00000 atm
elementType: 8 8 7 7 7 6 6 6 6 6 6 6 6 6 6 6 6 6 6 6 6 6 6 6 1 1 1 1 1 1 1 1 1 1 1 1 1 1 1 1 1 1 1 1 1 1 1
symmnumber: 1
zpe: 1014503.1 jmol-1
zpe.correction: 0.386404 hartree
zpe.thermalcorrener: 0.409368 hartree
zpe.thermalcorrenthalpy: 0.410312 hartree
zpe.thermalcorrgfe: 0.331948 hartree
zpe.sumelectzpe: -1050.793831 hartree
zpe.sumelectthermal: -1050.770867 hartree
zpe.sumelectthermalent: -1050.769923 hartree
zpe.sumelectthermalfe: -1050.848287 hartree
dipole: 3.1339 1.2983 0.0326
dipole: 3.3924
quadrupole: -132.8509 -132.1475 -145.4716
quadrupole: 7.7039 1.2720 -0.3370
quadrupole: 3.9724 4.6758 -8.6483 7.7039 1.2720 -0.3370
hfenergy: -1051.1802348 hartree
pointgroup: C01 [X(C19H23N3O2)]
dipole: 1.0977044 0.53183 0.5417662 debye
polarizability: 320.4674956|-6.1364229|251.0263827|58.8484865|46.1340125|169.8658595 unknown
InChI: InChI=1S/C19H23N3O2/c1-3-22(4-2)17(18(23)20-15-11-7-5-8-12-15)19(24)21-16-13-9-6-10-14-16/h5-14,17,20-21H,3-4H2,1-2H3
charge 0 multiplicity 1
47 atoms
O  -2.373095 1.746031 -0.490608
O  0.769407 -1.044003 -1.476717
N  0.400875 2.218393 0.239634
N  -1.803328 -0.315145 -1.471837
N  2.083218 0.247427 -0.006829
C  0.021871 1.255746 -0.820944
C  -0.248472 1.999163 1.570619
C  0.564748 3.638406 -0.191744
C  -1.513638 0.901964 -0.893613
C  0.989006 0.016146 -0.790399
C  0.550757 2.623508 2.728571
C  -0.724491 4.463633 -0.406392
C  -3.080163 -0.881205 -1.745128
C  3.208662 -0.57718 0.255529
C  -3.093179 -2.167897 -2.351852
C  4.20001 -0.065825 1.136285
C  -4.309426 -0.230765 -1.45062
C  3.371493 -1.865224 -0.321794
C  -4.315813 -2.795946 -2.660625
C  5.342582 -0.833146 1.438465
C  -5.525812 -0.874312 -1.76747
C  4.521815 -2.620932 -0.008534
C  -5.542593 -2.152672 -2.370695
C  5.510666 -2.116915 0.867485
H  0.230371 1.742465 -1.797621
H  -1.290394 2.372879 1.571689
H  -0.306752 0.903728 1.723552
H  1.15689 3.623925 -1.127789
H  1.197691 4.14159 0.56335
H  0.08224 2.348178 3.690709
H  0.568465 3.726716 2.675115
H  1.596088 2.261159 2.741803
H  -0.45688 5.479192 -0.75548
H  -1.302662 4.56594 0.528697
H  -1.389425 3.99063 -1.147336
H  -0.961005 -0.881112 -1.716836
H  1.988955 1.194995 0.430849
H  -2.144061 -2.669536 -2.577427
H  4.072671 0.929876 1.579332
H  -4.294888 0.755752 -0.984364
H  2.60486 -2.249861 -0.9974
H  -4.310498 -3.78742 -3.127046
H  6.100677 -0.429721 2.11875
H  -6.469961 -0.367114 -1.537932
H  4.643881 -3.614063 -0.455264
H  -6.493263 -2.640734 -2.610937
H  6.398501 -2.713513 1.1024
