program: Gaussian 09
title: 000294483
version: EM64L-G09RevD.01
frameworkgroup: C1[X(C26H18)]
method: RPBEPBE
basis: SDD
operation: Freq
keyword: #p
keyword: freq=noraman
keyword: PBEPBE/SDD
title: #p freq=noraman PBEPBE/SDD
converged: YES YES NO NO
title: Mulliken charges:
elementType: C C C C C C C C C C C C C C C C C C C C C C C C C C H H H H H H H H H H H H H H H H H H
charge: 0.100889 0.100895 0.337838 0.337805 0.329662 0.329644 0.458559 0.458546 -0.420344 -0.420293 -0.385318 -0.385378 -0.441999 -0.441949 -0.381121 -0.381115 -0.424868 -0.364916 -0.364860 -0.424900 -0.425691 -0.425687 -0.249881 -0.249886 -0.235974 -0.235974 0.220593 0.220575 0.236738 0.236771 0.249980 0.249978 0.231633 0.231629 0.231869 0.236469 0.236439 0.231865 0.245346 0.245344 0.225191 0.225190 0.225353 0.225352
chargesum: 0.00000
title: Mulliken charges with hydrogens summed into heavy atoms:
elementType: C C C C C C C C C C C C C C C C C C C C C C C C C C
charge: 0.100889 0.100895 0.337838 0.337805 0.329662 0.329644 0.458559 0.458546 -0.199751 -0.199718 -0.148579 -0.148608 -0.192019 -0.191971 -0.149488 -0.149486 -0.192999 -0.128447 -0.128421 -0.193034 -0.180345 -0.180343 -0.024690 -0.024696 -0.010621 -0.010622
polarizability: 9.49797861e+02 9.28780544e+00 2.59611486e+02 1.28709949e-03 9.15128127e-04 1.26796501e+02
1716.lowfreq: -3.5035 -1.9408 -0.0010 -0.0005 0.0008 3.0733 16.0793 20.8606 23.7106
frequency: 16.0719 20.8491 23.7064 55.7225 76.5234 84.4451 115.9839 135.8155 144.2079 190.5740 195.2892 213.7516 245.2525 297.4247 313.9401 323.5627 344.1418 388.5255 409.7042 416.3991 425.4694 437.8901 441.2422 524.4967 533.5118 545.1640 563.1357 566.7142 567.7160 605.9908 625.1296 643.4990 657.3198 660.1735 706.2819 720.9449 730.1616 744.5306 756.1011 762.6421 763.0606 785.8190 796.1528 803.8108 804.0478 810.0687 833.8116 837.2007 850.8408 852.7408 852.9714 879.9514 881.4408 910.6451 921.5947 931.0659 931.3949 945.7795 945.8306 973.0106 977.4811 981.2841 981.3109 1003.1780 1015.7938 1017.0577 1027.7894 1031.5879 1075.2772 1077.2998 1115.4743 1115.7116 1131.3663 1169.1472 1169.2059 1191.1631 1192.8692 1197.0414 1205.0317 1209.1647 1254.2440 1262.5738 1280.8586 1281.3220 1316.7335 1322.6723 1326.2580 1349.3796 1385.0559 1395.6550 1413.6873 1414.8062 1430.7975 1445.6429 1445.9667 1455.6974 1459.4064 1501.4282 1510.9384 1515.2896 1540.7400 1589.8861 1594.8016 1594.9083 1612.4538 1612.9165 1629.5832 1630.9341 3082.2360 3082.4162 3119.4287 3119.4332 3123.4395 3124.5255 3128.4173 3128.4266 3142.4033 3142.4064 3161.5428 3161.6700 3173.5479 3174.6420 3177.2137 3179.4961 3215.4994 3215.6186
redmass: 5.3616 4.9193 5.2208 4.9022 4.7384 4.1476 5.7430 6.4343 4.5934 5.2057 3.6796 4.2791 4.5104 5.2583 4.1974 4.9205 3.2848 2.9441 2.9967 3.0737 3.7056 3.0843 3.9374 3.6064 3.4198 6.7424 3.2176 3.9165 4.3955 6.9709 6.6478 5.0246 2.5827 2.9025 5.0715 5.6925 2.9515 2.3538 3.1286 1.3311 1.3172 4.5035 3.7211 1.8147 1.7537 4.6846 1.8968 1.2825 3.2812 4.6318 4.6963 1.4371 1.5105 1.5173 1.6688 1.3399 1.3538 1.4481 1.4475 1.4025 1.3767 1.3342 1.3342 2.9282 2.8503 2.5325 2.2862 2.3186 1.8376 1.7919 1.3165 1.2836 1.4436 1.0977 1.0989 2.0255 2.1115 1.4555 1.6073 1.9438 1.7583 1.9821 2.2308 1.8815 1.5466 1.6814 1.6330 3.6392 2.1411 2.9653 2.7395 2.6215 3.2743 2.7201 2.6085 3.5099 3.8837 2.9252 4.8746 4.2122 6.2598 6.0228 6.6144 6.5196 7.1800 7.3197 7.7564 6.9363 1.0872 1.0873 1.0864 1.0864 1.0898 1.0895 1.0886 1.0886 1.0941 1.0942 1.1001 1.1001 1.0917 1.0914 1.0926 1.0942 1.1013 1.1013
irintensity: 0.0016 0.0437 0.0797 0.1144 0.1907 0.0062 0.2672 0.3388 0.0565 0.1416 2.8543 1.2685 1.5865 0.2075 1.2992 1.7461 3.0493 2.6151 0.0295 7.4857 1.6527 3.2547 7.6910 24.3925 25.2944 1.7041 1.2885 0.1159 1.6772 1.2223 0.3924 0.1102 0.8390 0.7930 3.4519 0.7892 5.1763 20.9144 6.2535 24.8279 146.7443 32.7733 7.4046 38.7988 11.0841 36.0959 39.8746 2.7239 2.8223 26.0003 0.0556 1.1441 1.9223 2.1486 46.6368 0.9610 3.6397 1.3513 10.3923 0.4670 0.6365 0.2109 0.1384 0.3369 1.3131 24.7721 0.2071 24.7867 17.5054 2.0148 9.1306 0.2460 14.6579 21.5242 0.2638 0.2338 10.5711 2.0201 0.0186 19.8048 9.4242 0.3369 1.5074 8.4213 0.2138 9.2626 1.4159 6.8232 0.3009 53.3659 1.9572 5.7490 40.4944 97.5308 2.6611 427.6699 0.4204 29.7850 0.1264 49.8624 0.0000 0.0154 5.9715 0.0690 6.3278 0.0028 97.0830 0.3804 38.1804 1.3608 6.1257 2.4783 28.3834 0.0833 1.7664 0.3736 23.6511 36.0656 140.5242 1.7554 21.9356 0.7178 1.9216 2.0050 18.5683 2.9323
temp: 298.150 k
press: 1.00000 atm
elementType: 6 6 6 6 6 6 6 6 6 6 6 6 6 6 6 6 6 6 6 6 6 6 6 6 6 6 1 1 1 1 1 1 1 1 1 1 1 1 1 1 1 1 1 1
symmnumber: 1
zpe: 913064.6 jmol-1
zpe.correction: 0.347768 hartree
zpe.thermalcorrener: 0.367620 hartree
zpe.thermalcorrenthalpy: 0.368564 hartree
zpe.thermalcorrgfe: 0.296808 hartree
zpe.sumelectzpe: -999.821135 hartree
zpe.sumelectthermal: -999.801283 hartree
zpe.sumelectthermalent: -999.800339 hartree
zpe.sumelectthermalfe: -999.872095 hartree
dipole: 0.0002 -0.0001 -0.1795
dipole: 0.1795
quadrupole: -139.0568 -132.0353 -159.8880
quadrupole: -0.8188 -0.0003 0.0003
quadrupole: 4.6032 11.6247 -16.2280 -0.8188 -0.0003 0.0003
hfenergy: -1000.1689027 hartree
pointgroup: C01 [X(C26H18)]
dipole: 0.0001584 -0.0706349 0.0000292 debye
polarizability: 947.4789962|0.6847651|126.7970819|-40.999264|-0.069193|261.9297703 unknown
InChI: InChI=1S/C26H18/c1-3-7-25-21(5-1)13-15-23(25)17-19-9-11-20(12-10-19)18-24-16-14-22-6-2-4-8-26(22)24/h1-18H
charge 0 multiplicity 1
44 atoms
C  5.369597 -0.039994 -0.014906
C  -5.369089 -0.04875 0.014802
C  3.937127 0.100395 -0.403665
C  -3.936934 0.093854 0.403932
C  6.170183 0.424902 -1.112025
C  -6.170698 0.414157 1.112013
C  1.438332 -0.235182 0.164217
C  -1.437457 -0.237395 -0.163842
C  2.877868 -0.237309 0.419931
C  -2.876978 -0.241724 -0.419647
C  3.947076 0.679613 -1.763478
C  -3.948166 0.672469 1.763996
C  5.253899 0.874154 -2.173899
C  -5.255405 0.864437 2.1743
C  5.98177 -0.531089 1.152196
C  -5.98018 -0.540248 -1.152697
C  0.552272 -0.270272 1.287426
C  -0.84089 -0.261028 1.135531
C  0.841813 -0.259073 -1.135165
C  -0.551333 -0.27048 -1.287063
C  7.576755 0.401802 -1.038379
C  -7.577213 0.388662 1.038075
C  7.399576 -0.550252 1.227087
C  -7.397936 -0.561828 -1.227881
C  8.187884 -0.089662 0.144144
C  -8.187256 -0.103209 -0.144839
H  3.147761 -0.545121 1.441901
H  -3.146256 -0.549475 -1.441797
H  3.061179 0.968366 -2.328143
H  -3.062908 0.962559 2.328969
H  5.570507 1.309877 -3.124676
H  -5.572955 1.299127 3.125238
H  5.38837 -0.896904 1.998627
H  -5.385978 -0.904566 -1.999212
H  0.981736 -0.302626 2.296446
H  -1.47492 -0.325864 2.023207
H  1.475966 -0.322391 -2.02287
H  -0.980746 -0.302984 -2.2961
H  8.191228 0.753755 -1.874693
H  -8.192461 0.739096 1.874459
H  7.889817 -0.926174 2.131983
H  -7.887344 -0.938097 -2.133083
H  9.280626 -0.115467 0.222256
H  -9.279936 -0.130862 -0.223181
