program: Gaussian 09
title: 000294506
version: EM64L-G09RevD.01
frameworkgroup: C1[X(C12H22BrNO3)]
method: RPBEPBE
basis: SDD
operation: Freq
keyword: #p
keyword: freq=noraman
keyword: PBEPBE/SDD
title: #p freq=noraman PBEPBE/SDD
converged: YES YES NO NO
title: Mulliken charges:
elementType: Br O O O N C C C C C C C C C C C C H H H H H H H H H H H H H H H H H H H H H H
charge: -0.018767 -0.255815 -0.446522 -0.211840 -0.387714 -0.425357 -0.014582 -0.126114 -0.040783 -0.363344 -0.652511 0.332436 -0.703372 -0.704078 -0.702618 -0.698898 0.134626 0.253705 0.228297 0.196126 0.285903 0.209258 0.224917 0.266440 0.292875 0.339154 0.214253 0.214522 0.225612 0.213149 0.242634 0.194155 0.198138 0.220028 0.219428 0.242664 0.211007 0.202311 0.390676
chargesum: 0.00000
title: Mulliken charges with hydrogens summed into heavy atoms:
elementType: Br O O O N C C C C C C C C C C C C
charge: -0.018767 -0.255815 -0.055846 -0.211840 -0.048560 0.056644 0.181543 0.159789 0.168475 0.128013 -0.359636 0.332436 -0.048984 -0.054140 -0.065024 -0.042915 0.134626
polarizability: 1.79277973e+02 -2.96111315e+00 1.73067896e+02 3.72450474e-02 2.39400367e+00 1.35837515e+02
1716.lowfreq: -11.7237 -10.5420 0.0005 0.0006 0.0007 5.5868 15.2552 24.8010 30.7844
frequency: 13.5778 24.2477 30.6412 38.2484 58.1883 77.8780 79.6478 93.5279 112.3883 132.1774 135.5016 186.6574 196.5178 206.6159 214.8376 245.5464 251.4781 263.7210 268.0276 298.4126 322.9947 340.5563 366.8153 370.6820 386.4254 403.4597 469.9987 527.6930 530.7224 564.5477 569.4261 596.2146 643.9799 653.8988 709.7814 740.8911 754.2941 780.6295 810.3968 863.4362 883.2358 912.6136 914.8896 926.6209 943.6628 958.6957 963.5084 967.2305 1005.6342 1018.9052 1059.6159 1073.7593 1107.0451 1119.2476 1126.3951 1143.9392 1163.0654 1189.3027 1195.9111 1202.8604 1229.3296 1238.5214 1259.7209 1285.3018 1292.1848 1311.0461 1320.6401 1336.1939 1342.6588 1350.3478 1361.4850 1367.6902 1381.3704 1381.4098 1398.8615 1399.8466 1451.9418 1454.9020 1462.9731 1464.8586 1475.5597 1478.5026 1481.5590 1482.9116 1483.1484 1489.5300 1496.0728 1609.2833 1676.0414 2956.0963 2967.5119 2970.8499 2971.3227 2974.8766 2979.8788 2992.4493 3008.5113 3010.5044 3052.6191 3055.2028 3058.3406 3060.4817 3065.3360 3070.8118 3071.1042 3077.7304 3078.2694 3081.9147 3087.5832 3523.5633 3562.8782
redmass: 5.0462 3.2838 3.3726 3.8779 4.2780 8.0712 5.1047 4.4441 3.7285 4.2806 4.6620 3.0902 3.8836 4.5858 1.2250 1.2316 3.2884 1.0506 1.0681 5.6880 2.9587 2.8977 2.1813 2.1318 2.0953 2.4388 3.4617 2.4574 3.2277 2.0606 1.6772 3.3109 2.1942 2.4036 4.0788 4.0992 3.9739 3.2861 3.5841 2.0830 2.1966 1.4388 1.3586 1.6577 1.7930 1.9391 1.5487 1.9218 2.2993 2.1060 1.9536 2.0063 1.5256 1.7259 1.6861 1.8043 1.8771 1.9524 1.7769 2.1807 1.2591 1.3247 1.2709 1.3946 1.5781 1.5820 1.5810 1.5278 1.3965 1.4102 1.4808 1.3082 1.2065 1.2072 1.2156 1.2143 1.0871 1.0847 1.0477 1.0467 1.4263 1.1437 1.0934 1.0973 1.0688 1.0511 1.0722 6.7922 8.9310 1.0819 1.0365 1.0783 1.0361 1.0407 1.0359 1.0639 1.0798 1.0613 1.1020 1.0977 1.0986 1.0931 1.0965 1.0993 1.0986 1.0999 1.0989 1.0994 1.0995 1.0643 1.0779
irintensity: 0.4947 0.7109 0.0649 0.4439 3.0934 1.3632 0.5808 0.7276 1.9801 3.6727 1.9703 1.5063 1.3343 2.0099 1.2364 0.4115 5.4253 0.3366 0.2131 5.7378 3.0905 0.3118 1.4925 0.4426 7.1376 5.7479 17.3119 21.0441 40.7855 29.1149 95.4163 4.1173 120.5357 75.0405 8.7514 5.9819 2.7522 1.4900 2.6193 17.8230 16.8666 2.8879 7.7011 21.5859 9.4882 1.4159 3.8224 0.9552 7.0740 12.0892 119.6350 36.2393 7.2012 15.9327 25.5037 9.8774 23.8281 17.5501 20.1200 16.4020 1.4305 5.0738 2.4149 13.5734 40.3701 8.3845 2.2128 6.1310 11.9797 3.4725 8.0110 3.4445 26.6884 5.4727 10.8611 24.1391 13.8887 9.2447 5.7446 2.4705 166.7714 57.9312 96.5078 6.2610 12.2303 12.2804 16.3470 121.7086 219.4408 15.5529 25.7232 12.5375 27.8704 29.5521 30.0062 20.0536 14.5769 16.2820 14.4580 11.9063 36.2081 18.0300 102.5971 27.5517 71.9392 24.2559 14.0059 41.5649 27.5455 32.9087 42.8629
temp: 298.150 k
press: 1.00000 atm
elementType: 35 8 8 8 7 6 6 6 6 6 6 6 6 6 6 6 6 1 1 1 1 1 1 1 1 1 1 1 1 1 1 1 1 1 1 1 1 1 1
symmnumber: 1
zpe: 859233.1 jmol-1
zpe.correction: 0.327265 hartree
zpe.thermalcorrener: 0.348312 hartree
zpe.thermalcorrenthalpy: 0.349256 hartree
zpe.thermalcorrgfe: 0.274145 hartree
zpe.sumelectzpe: -763.011333 hartree
zpe.sumelectthermal: -762.990286 hartree
zpe.sumelectthermalent: -762.989341 hartree
zpe.sumelectthermalfe: -763.064453 hartree
dipole: -0.3307 1.1495 -3.6164
dipole: 3.8091
quadrupole: -111.0625 -117.4300 -115.7324
quadrupole: 10.7377 2.4000 -6.0485
quadrupole: 3.6792 -2.6884 -0.9908 10.7377 2.4000 -6.0485
hfenergy: -763.3385978 hartree
pointgroup: C01 [X(C12H22Br1N1O3)]
dipole: -0.2148081 -0.8199316 1.2358712 debye
polarizability: 178.371197|2.1928111|169.6558887|4.3173728|11.9128435|140.1562983 unknown
InChI: InChI=1S/C12H22BrNO3/c1-7(2)5-9(13)11(15)14-10(12(16)17)6-8(3)4/h7-10,14,16H,5-6H2,1-4H3
charge 0 multiplicity 1
39 atoms
Br 1.726861 2.663753 1.3634
O  1.025482 0.622061 -1.480178
O  -2.008884 -1.863393 1.239713
O  -3.102968 -2.206753 -0.78322
N  -0.334753 -0.06628 0.27417
C  -2.363586 0.856814 -0.974049
C  -3.277521 1.506538 0.104944
C  -1.463457 -0.376885 -0.614133
C  3.828592 -1.042147 0.295507
C  3.368265 0.452986 0.281699
C  1.946449 0.683599 0.80502
C  0.84933 0.423501 -0.239209
C  -4.503056 0.639884 0.490456
C  -2.529851 1.989197 1.372324
C  3.962871 -1.601215 1.7338
C  2.956936 -1.969926 -0.585265
C  -2.275855 -1.561251 -0.110383
H  -1.65895 1.617408 -1.360768
H  -2.997335 0.542212 -1.826352
H  -3.675272 2.414398 -0.397735
H  -1.018295 -0.691007 -1.579089
H  4.845605 -1.023665 -0.148927
H  4.074235 1.032333 0.904037
H  3.415148 0.851987 -0.748046
H  1.751385 0.158022 1.754237
H  -0.454246 -0.210669 1.277841
H  -5.217386 1.236142 1.088197
H  -4.213175 -0.230233 1.107029
H  -5.033632 0.262459 -0.402398
H  -3.192311 2.631009 1.982901
H  -1.624588 2.571141 1.122631
H  -2.225553 1.138657 2.011871
H  2.977521 -1.70336 2.228384
H  4.422403 -2.606719 1.717305
H  4.594874 -0.948466 2.364702
H  2.825082 -1.554803 -1.599805
H  3.425301 -2.967864 -0.67237
H  1.949778 -2.115771 -0.149315
H  -2.56785 -2.636891 1.521372
