program: Gaussian 09
title: 000027253
version: EM64L-G09RevD.01
frameworkgroup: C1[X(C10H16)]
method: RPBEPBE
basis: SDD
operation: Freq
keyword: #p
keyword: freq=noraman
keyword: PBEPBE/SDD
title: #p freq=noraman PBEPBE/SDD
converged: YES YES NO NO
title: Mulliken charges:
elementType: C C C C C C C C C C H H H H H H H H H H H H H H H H
charge: -0.583590 -0.499100 -0.556337 0.560779 -0.432078 0.431160 -0.377666 -0.405727 -0.823157 -0.733913 0.212712 0.202903 0.222196 0.201878 0.217750 0.200806 0.214265 0.199462 0.204074 0.211789 0.219092 0.225299 0.219863 0.224871 0.220582 0.222089
chargesum: 0.00000
title: Mulliken charges with hydrogens summed into heavy atoms:
elementType: C C C C C C C C C C
charge: -0.167975 -0.075026 -0.137782 0.560779 -0.018351 0.431160 -0.173592 -0.193937 -0.158903 -0.066372
polarizability: 1.37286847e+02 1.03535345e-01 1.05514004e+02 3.72375875e-02 1.76707510e+00 7.60943940e+01
1716.lowfreq: -24.0653 -9.8572 -0.0010 -0.0009 -0.0008 5.9224 26.0168 99.2040 126.8183
frequency: 25.0938 99.1753 126.7494 155.8087 192.5796 217.3798 266.5456 290.3226 292.7172 318.6918 358.1822 421.2518 503.2367 511.6466 552.0404 615.5063 691.0064 743.6549 815.3411 834.6570 867.0529 886.0886 924.8244 954.3881 985.9837 1010.3678 1029.1512 1033.5465 1039.9927 1060.9020 1093.6422 1108.9969 1155.8277 1160.4062 1176.8800 1219.5580 1237.4308 1260.1769 1302.7680 1315.5716 1337.4486 1342.6213 1373.8180 1382.4976 1392.8659 1395.5788 1449.2635 1455.2930 1456.3099 1462.5288 1468.9171 1471.6195 1473.8892 1475.6407 1681.8162 1692.7497 2949.2176 2953.9650 2956.1658 2960.7529 2962.6511 2962.9341 2997.0940 3012.3133 3024.9463 3027.6899 3030.0544 3032.0004 3066.5820 3074.3620 3080.6059 3090.1000
redmass: 2.8731 1.0363 2.4321 1.7310 1.3329 2.4295 2.3072 2.3463 2.6625 2.7639 2.5195 1.9985 3.1830 2.4943 2.2082 2.7655 2.8163 2.2084 1.3725 1.1864 2.0192 2.2539 1.9534 1.8820 1.4710 1.7857 1.8373 2.0599 1.5879 2.0931 2.3971 2.8545 1.7471 1.1720 1.1950 2.0862 1.1316 1.2409 1.4052 1.5129 1.4500 1.3470 1.7488 1.4917 1.2218 1.2368 1.0875 1.0937 1.0724 1.0586 1.0516 1.0737 1.0615 1.0720 6.9782 6.6145 1.0582 1.0634 1.0443 1.0628 1.0470 1.0537 1.0971 1.0971 1.0966 1.0976 1.0966 1.0929 1.0896 1.0960 1.0916 1.0951
irintensity: 0.0219 0.3247 0.0328 2.8087 0.5713 0.0445 0.9993 3.4274 0.6236 1.3588 0.3865 4.4920 3.7307 1.5404 8.5008 0.9560 0.8105 1.0985 26.2704 16.1372 4.5349 2.0149 1.2397 11.3902 8.2528 16.2003 9.7868 4.9354 0.0382 0.4766 0.7497 5.3723 2.2276 4.6109 0.8600 3.7718 1.8253 4.5751 0.5626 1.3987 1.2083 1.3686 1.4792 0.5723 9.6332 14.9759 10.3100 10.6076 13.2102 5.6210 10.9970 3.9451 23.9944 15.5823 2.7856 2.9534 16.9885 28.3195 59.0857 7.0893 39.8219 62.2502 42.7243 41.3709 32.1158 40.7808 40.2447 31.1152 6.0170 5.0876 77.2901 56.5945
temp: 298.150 k
press: 1.00000 atm
elementType: 6 6 6 6 6 6 6 6 6 6 1 1 1 1 1 1 1 1 1 1 1 1 1 1 1 1
symmnumber: 1
zpe: 606204.2 jmol-1
zpe.correction: 0.230891 hartree
zpe.thermalcorrener: 0.241954 hartree
zpe.thermalcorrenthalpy: 0.242898 hartree
zpe.thermalcorrgfe: 0.194074 hartree
zpe.sumelectzpe: -389.840229 hartree
zpe.sumelectthermal: -389.829167 hartree
zpe.sumelectthermalent: -389.828222 hartree
zpe.sumelectthermalfe: -389.877047 hartree
dipole: 0.0907 -0.0790 -0.1710
dipole: 0.2091
quadrupole: -60.6252 -59.9126 -64.2384
quadrupole: -0.7936 0.1854 -0.3040
quadrupole: 0.9669 1.6795 -2.6464 -0.7936 0.1854 -0.3040
hfenergy: -390.0711205 hartree
pointgroup: C01 [X(C10H16)]
dipole: 0.0352395 0.0323414 0.0669122 debye
dipolederiv: 0.0057508 -0.054152 0.0006813 0.047261 0.0614997 0.0224322 -0.0014418 0.039193 0.1072162 -0.0503729 0.0433536 -0.0340603 0.0160823 0.0819057 0.0069737 0.0094011 -0.0562617 0.1372255 0.037029 0.0310454 0.0333301 -0.0206769 -0.0085785 0.0395092 -0.0109429 0.0625028 0.0996555 0.1660633 -0.0437397 -0.0160426 -0.0848398 0.1109996 -0.1150731 -0.0022202 -0.1242709 -0.0978113 0.0010321 -0.0096011 0.0002875 0.0216152 0.1301976 -0.0215698 -0.0526353 -0.0706577 0.1633243 0.2300945 -0.0496313 0.0328221 -0.0658569 0.196296 0.0576704 0.0195663 0.0729634 -0.1184865 0.1295776 0.0359843 0.069215 -0.0275123 -0.081709 0.0152149 0.0901028 0.0635242 -0.2792458 0.0617381 0.012632 -0.0897461 0.0938947 0.0171948 -0.1554073 -0.1360393 -0.1159215 -0.2043798 -0.1071913 0.0009917 -0.0376379 -0.0379791 0.0204105 -0.0143614 -0.0304712 -0.0195035 0.0929756 -0.1335937 -0.0597294 0.0706401 0.0106204 0.014514 0.0455118 0.1019308 0.0495988 0.0899001 -0.0280762 -0.0107237 0.0817173 -0.0490052 0.0547732 -0.0968893 0.0893772 -0.0465419 -0.1021345 -0.0309155 0.1256086 -0.0438589 0.0624322 -0.1418649 0.0687797 -0.0284855 0.0319815 0.0719101 0.0542977 0.0808305 0.0429443 0.0387642 0.0256515 -0.0296934 0.0137152 -0.0788177 -0.131881 -0.0780745 -0.1151701 0.0340991 -0.1148524 -0.1129298 0.0403876 0.0160895 0.095629 0.0619866 0.0403258 0.0508999 -0.0768474 0.0769019 0.0233004 -0.0359804 -0.0635968 0.0078921 -0.120243 -0.1196163 -0.1467987 0.0152252 -0.0943486 -0.0500313 0.0274519 0.0214546 -0.0000974 0.0805554 -0.0139878 -0.0735192 -0.0593911 -0.0254616 0.0928762 0.0203575 -0.0462293 -0.0538536 -0.1523471 -0.0055019 0.0255351 -0.0065236 0.0295153 -0.2000221 0.0291814 0.0190278 0.0848145 0.0783562 -0.1515729 0.1046713 -0.0010394 0.1128946 -0.0358124 -0.0133447 -0.0278332 -0.0055776 0.1538578 0.0205208 0.0042002 0.0219728 0.0268246 -0.1365905 0.1127266 0.0030063 0.108577 0.1016239 0.0011573 -0.0764014 0.0117285 -0.1082403 -0.0402136 0.1059752 0.0816736 0.1276019 -0.0129997 -0.0467165 0.0756757 -0.0224533 0.181843 -0.0686538 0.0113196 0.0001322 -0.0087964 0.0999013 0.0469228 -0.0325155 0.009391 -0.0382743 0.0327544 -0.1147728 -0.0646187 -0.1313437 -0.1073996 -0.0090237 0.0255683 0.0807971 0.0151823 0.0413941 -0.0999164 0.1611541 -0.0860442 -0.0688285 0.1012631 0.0755987 -0.0208442 -0.0086133 -0.1314944 0.0742628 -0.0094313 0.0580422 0.0748271 -0.1211297 -0.0206132 -0.0964066 -0.0581707 0.1041327 0.019254 -0.1526859 -0.0046326 -0.017559 unknown
polarizability: 137.2796762|0.4742148|105.550269|-0.1887788|1.498307|76.0652995 unknown
InChI: InChI=1S/C10H16/c1-3-10-6-4-5-9(2)7-8-10/h3,5H,4,6-8H2,1-2H3
charge 0 multiplicity 1
26 atoms
C  -0.20613 1.131098 -0.740293
C  1.063084 1.298597 0.13902
C  -0.811463 -1.130287 0.368058
C  -1.279912 0.22771 -0.145439
C  0.360196 -1.761547 -0.433866
C  2.053445 0.134675 0.118478
C  1.736107 -1.16065 -0.167824
C  -2.575344 0.6541 -0.087989
C  3.487787 0.52754 0.440334
C  -3.779685 -0.086592 0.454559
H  0.120851 0.733834 -1.723891
H  -0.646197 2.12809 -0.9347
H  0.765271 1.522988 1.185758
H  1.60709 2.200888 -0.209894
H  -0.478312 -1.032452 1.423033
H  -1.659122 -1.840675 0.378534
H  0.124456 -1.735885 -1.519023
H  0.41456 -2.836011 -0.169296
H  2.566192 -1.883925 -0.182593
H  -2.790946 1.664748 -0.470143
H  3.88324 1.24718 -0.304617
H  4.160545 -0.34746 0.464254
H  3.548354 1.031104 1.426382
H  -4.190656 0.427331 1.346687
H  -3.549013 -1.124438 0.748778
H  -4.594298 -0.117261 -0.295406
