program: Gaussian 09
title: 000296401
version: EM64L-G09RevD.01
frameworkgroup: C1[X(C13H11ClN4O3S)]
method: RPBEPBE
basis: SDD
operation: Freq
keyword: #p
keyword: freq=noraman
keyword: PBEPBE/SDD
title: #p freq=noraman PBEPBE/SDD
converged: YES YES NO NO
title: Mulliken charges:
elementType: Cl S O O O N N N N C C C C C C C C C C C C C H H H H H H H H H H H
charge: 0.081058 0.361552 -0.197417 -0.187543 -0.186760 0.046217 -0.373049 -0.010789 0.031380 -0.785462 0.469653 -0.377358 0.527909 -0.374258 -0.374231 0.019390 -0.220851 -0.220862 -0.319013 -0.233785 0.228945 -0.789891 0.302143 0.302470 0.236708 0.236708 0.228854 0.228854 0.231172 0.353973 0.245519 0.273352 0.245413
chargesum: 0.00000
title: Mulliken charges with hydrogens summed into heavy atoms:
elementType: Cl S O O O N N N N C C C C C C C C C C C C C
charge: 0.081058 0.361552 -0.197417 -0.187543 -0.186760 0.046217 -0.019076 -0.010789 0.031380 -0.180849 0.469653 -0.377358 0.527909 -0.137549 -0.137523 0.019390 0.008003 0.007992 -0.319013 -0.002613 0.228945 -0.025608
polarizability: 3.44152289e+02 -5.15239062e+00 2.43516008e+02 2.90302442e-02 2.89276353e-02 1.26644764e+02
1716.lowfreq: -45.4920 -11.7725 -3.5610 -2.1812 0.0025 0.0028 0.0034 5.3168 20.3201
frequency: -45.4717 -8.2502 20.3152 27.6714 30.9736 38.1349 53.0130 73.5364 84.0033 117.1286 139.1482 168.8259 173.0855 198.9257 224.3073 247.5948 270.0932 283.1238 302.6163 322.4531 335.5818 363.9997 401.9081 440.7443 459.7263 470.9085 542.9741 558.3337 570.0959 582.5019 583.1280 616.1624 629.2679 630.1054 699.1438 701.5543 707.8197 736.6975 764.9852 773.5518 774.0609 784.4407 810.9776 850.5168 864.9127 891.2934 925.8756 945.1526 976.9333 989.8247 993.5666 997.4446 1025.7340 1035.5721 1036.2606 1071.3523 1120.2687 1171.7847 1173.6748 1183.7314 1188.1145 1206.5434 1219.4444 1227.5480 1242.5982 1283.9006 1324.4395 1340.9407 1379.7814 1383.9912 1397.3827 1420.9953 1439.8085 1445.3751 1447.6397 1466.0300 1480.9146 1482.7420 1533.6132 1592.5025 1612.9113 1664.0940 2990.4955 3066.5446 3075.9194 3122.9752 3124.5253 3137.6913 3140.6545 3143.9876 3149.5378 3166.1366 3518.1885
redmass: 13.6557 4.6995 6.4640 1.2922 4.2279 6.3235 4.0744 4.1279 5.8635 7.7413 7.5627 13.3033 6.9610 7.2944 16.3564 11.2231 6.9812 5.3399 9.3174 2.2058 12.7030 10.7515 2.7934 13.6783 6.6383 4.2566 6.8566 7.2887 3.3208 9.3463 6.1740 6.3200 8.0428 4.7903 2.7449 1.6770 8.3425 2.0449 12.3974 5.8030 2.5843 6.0671 4.1037 1.2666 1.5510 4.2558 1.4505 6.0377 1.3927 6.2334 2.3940 1.3219 2.1973 1.6935 8.0163 1.4727 1.0978 4.8515 1.0527 4.3210 1.1590 4.5382 2.0077 4.5204 1.9471 11.6395 1.2815 7.9249 1.2306 8.8120 5.0263 1.1620 2.1994 1.7927 2.5626 1.0462 2.7811 2.3461 3.7636 6.0778 6.1197 7.0044 1.0384 1.0590 1.0982 1.0854 1.0884 1.0919 1.0984 1.1074 1.0965 1.1017 1.0766
irintensity: 0.0063 0.1338 1.1429 2.9363 0.3850 0.9283 3.7935 0.6846 1.1768 0.0003 4.0677 0.0515 3.7572 0.0008 2.0312 1.0857 8.1889 3.9559 5.9740 2.0197 1.9694 0.3449 0.0000 6.8027 17.3537 3.1131 16.1007 12.4592 0.1705 0.7285 10.2361 0.1032 0.5098 12.9433 25.3105 55.9824 6.2484 44.3425 83.2332 36.1936 63.4615 36.3202 11.2016 0.0168 0.2382 13.9873 2.9613 10.3235 0.0001 1.3464 38.5589 0.0494 7.1750 9.7406 40.3518 7.1318 2.9678 555.6257 0.0217 30.2255 1.7764 25.4298 10.4196 130.5357 32.8696 26.6523 0.2348 61.1976 79.0402 0.2337 321.5069 54.5939 8.6009 351.3564 85.3398 20.7702 1146.4897 38.9165 278.9950 1.0907 2.0546 158.8807 3.6729 2.5242 9.8229 7.4887 1.1855 13.3175 5.6977 0.3262 39.1309 27.5413 59.7664
temp: 298.150 k
press: 1.00000 atm
elementType: 17 16 8 8 8 7 7 7 7 6 6 6 6 6 6 6 6 6 6 6 6 6 1 1 1 1 1 1 1 1 1 1 1
symmnumber: 1
zpe: 594457.2 jmol-1
zpe.correction: 0.226417 hartree
zpe.thermalcorrener: 0.245829 hartree
zpe.thermalcorrenthalpy: 0.246773 hartree
zpe.thermalcorrgfe: 0.174839 hartree
zpe.sumelectzpe: -1803.121097 hartree
zpe.sumelectthermal: -1803.101684 hartree
zpe.sumelectthermalent: -1803.100740 hartree
zpe.sumelectthermalfe: -1803.172674 hartree
dipole: -0.0292 6.7782 -0.0016
dipole: 6.7783
quadrupole: -130.8885 -145.3834 -132.5098
quadrupole: 24.3935 -0.0047 0.0128
quadrupole: 5.3721 -9.1228 3.7507 24.3935 -0.0047 0.0128
hfenergy: -1803.3475134 hartree
pointgroup: C01 [X(C13H11Cl1N4O3S1)]
dipole: 0.077976 -2.6656467 0.0001865 debye
polarizability: 343.6935104|8.5146529|243.9746991|-0.131002|0.0421014|126.6448511 unknown
InChI: InChI=1S/C13H11ClN4O3S/c1-8(19)15-13-16-11(14)10(18(20)21)12(17-13)22-7-9-5-3-2-4-6-9/h2-6,15H,7H2,1H3
charge 0 multiplicity 1
33 atoms
Cl 4.948942 1.665278 -0.003712
S  -0.786102 1.305687 0.001757
O  0.737999 3.450064 -0.000083
O  2.997097 3.734715 -0.002592
O  0.247795 -3.452496 -0.001544
N  1.0250 -0.678044 0.000221
N  2.449916 -2.593795 -0.001514
N  3.439696 -0.5005 -0.002363
N  1.952549 2.98192 -0.001803
C  -1.741062 -0.387016 0.003561
C  -3.214421 -0.070002 0.002201
C  0.908502 0.680783 0.000062
C  2.087746 1.523566 -0.001425
C  -3.920133 0.080665 -1.22043
C  -3.921777 0.08419 1.22344
C  2.260448 -1.2128 -0.001166
C  -5.302177 0.371268 -1.223089
C  -5.303829 0.374804 1.223393
C  3.343705 0.835046 -0.002413
C  -5.998168 0.519306 -0.000526
C  1.485814 -3.641685 -0.001597
C  2.135885 -5.023137 -0.00245
H  -1.403208 -0.935148 0.894445
H  -1.402035 -0.93787 -0.885175
H  -3.383561 -0.033976 -2.16999
H  -3.386498 -0.027702 2.174061
H  -5.834868 0.480966 -2.174203
H  -5.837798 0.487258 2.173468
H  -7.07047 0.744508 -0.001571
H  3.44062 -2.856572 -0.002189
H  2.768504 -5.16623 -0.897991
H  1.344281 -5.785417 -0.001274
H  2.771306 -5.166232 0.891092
