program: Gaussian 09
title: 000296397
version: EM64L-G09RevD.01
frameworkgroup: C1[X(C11H12N6O2S)]
method: RPBEPBE
basis: SDD
operation: Freq
keyword: #p
keyword: freq=noraman
keyword: PBEPBE/SDD
title: #p freq=noraman PBEPBE/SDD
converged: YES YES NO NO
title: Mulliken charges:
elementType: S O O N N N N N N C C C C C C C C C C C H H H H H H H H H H H H
charge: 0.287806 -0.233736 -0.207509 -0.385448 -0.366518 -0.157744 -0.033779 -0.007945 0.006051 -0.172191 -0.452874 -0.513184 0.157525 0.234278 0.153348 0.134215 -0.180088 -0.356252 -0.370912 -0.821013 0.265684 0.215177 0.263461 0.247269 0.259829 0.351154 0.340447 0.279736 0.250726 0.284768 0.282493 0.245224
chargesum: 0.00000
title: Mulliken charges with hydrogens summed into heavy atoms:
elementType: S O O N N N N N N C C C C C C C C C C C
charge: 0.287806 -0.233736 -0.207509 -0.034293 -0.026071 -0.157744 -0.033779 -0.007945 0.006051 0.093493 0.025764 -0.006085 0.157525 0.234278 0.153348 0.134215 0.099648 -0.356252 -0.120186 -0.008528
polarizability: 2.72254742e+02 9.62855297e-01 1.71465377e+02 -1.46664235e+01 2.66626650e+00 1.18712480e+02
1716.lowfreq: -3.1069 -0.0017 -0.0015 -0.0007 1.1970 9.3231 18.9021 25.8558 31.9797
frequency: 18.5191 25.4925 31.9714 43.0751 71.6953 88.7031 105.0546 117.5045 127.1828 148.1568 172.0355 204.7224 234.1511 251.6375 261.1144 283.4841 332.8823 368.0780 403.4501 451.2105 494.5529 504.3988 532.1458 550.6578 558.3257 565.8331 596.7073 621.2295 635.1045 643.6523 651.9082 667.7416 683.1877 734.2305 789.4980 797.1099 817.8068 823.9568 829.2778 875.9390 902.2222 902.9322 923.5711 972.8800 980.0739 992.6306 1007.4508 1041.8659 1097.1351 1111.8451 1131.2243 1142.7753 1166.0057 1181.2381 1202.0049 1228.6763 1246.8843 1271.1176 1276.4605 1290.2174 1300.0353 1301.1910 1308.5633 1330.0948 1346.6958 1382.4528 1387.6456 1393.7795 1434.4777 1443.3377 1448.1999 1453.8051 1469.6037 1476.4674 1524.7767 1540.8790 1651.0522 1676.5170 2925.1468 3012.1483 3018.7421 3028.1415 3076.4868 3103.1453 3153.9135 3160.6962 3174.7829 3245.0117 3519.6341 3567.9277
redmass: 7.1771 4.3917 6.2744 8.7939 4.3847 4.4382 1.4443 2.7692 5.2125 2.5973 4.2793 8.0227 5.6448 4.6952 5.1056 5.8268 6.9774 6.8298 11.2872 4.3265 1.5811 1.5370 4.4602 4.0577 4.8170 7.9767 2.0528 7.1636 4.8809 3.1957 7.1230 7.3721 4.6569 5.9590 4.9611 5.3889 3.4579 2.0317 3.0733 3.1735 5.3929 2.9674 1.4411 3.4412 1.1796 1.2964 2.2410 2.0973 5.3251 2.6191 2.5881 2.4696 2.3480 3.7984 1.2996 1.9768 2.3067 1.3929 5.4079 1.5459 1.4971 5.3252 4.1454 1.6417 1.1351 1.9761 2.4232 2.7158 1.0521 4.8823 1.0704 1.0844 1.4900 1.0994 9.6897 10.5507 8.8642 9.0717 1.0824 1.0590 1.0670 1.0281 1.1043 1.0997 1.1044 1.1056 1.0925 1.0999 1.0787 1.0787
irintensity: 1.4526 1.5807 1.2404 0.8532 6.2499 1.8476 0.8558 2.4824 1.8297 2.1771 5.2618 0.6692 3.2122 5.7722 4.9881 6.6169 0.8058 12.9265 2.9233 18.3947 28.5468 91.4468 1.0524 16.5538 4.2227 12.6218 76.2300 5.7510 30.8236 54.3713 7.3219 10.4736 24.6691 13.3555 5.5325 21.4800 7.5172 9.3023 6.4075 13.7278 71.9055 20.2113 11.3974 2.8655 6.6171 6.6732 8.9567 4.1707 15.1306 28.5219 44.1521 75.5325 170.8460 10.4956 4.9997 11.7765 100.7520 1.0712 39.3716 18.7960 21.9695 60.1972 81.7945 14.5197 1.6101 38.3314 32.8516 15.3579 14.9183 5.4403 30.8625 8.8211 116.1756 12.4084 283.9715 39.5432 166.8506 467.5311 37.7461 27.9667 11.2828 20.3213 17.6663 11.4061 7.1945 8.8443 11.3595 1.7611 24.0625 52.9731
temp: 298.150 k
press: 1.00000 atm
elementType: 16 8 8 7 7 7 7 7 7 6 6 6 6 6 6 6 6 6 6 6 1 1 1 1 1 1 1 1 1 1 1 1
symmnumber: 1
zpe: 616303.8 jmol-1
zpe.correction: 0.234738 hartree
zpe.thermalcorrener: 0.253129 hartree
zpe.thermalcorrenthalpy: 0.254073 hartree
zpe.thermalcorrgfe: 0.184820 hartree
zpe.sumelectzpe: -1301.926290 hartree
zpe.sumelectthermal: -1301.907899 hartree
zpe.sumelectthermalent: -1301.906955 hartree
zpe.sumelectthermalfe: -1301.976208 hartree
dipole: -1.2553 0.1365 -5.8751
dipole: 6.0092
quadrupole: -140.7788 -121.7909 -124.4911
quadrupole: 18.7297 -24.5681 -1.2205
quadrupole: -11.7585 7.2294 4.5292 18.7297 -24.5681 -1.2205
hfenergy: -1302.1610281 hartree
pointgroup: C01 [X(C11H12N6O2S1)]
dipole: 0.4465965 0.1941371 2.3135111 debye
polarizability: 272.6935556|2.2374507|171.0537232|-11.7040326|-5.9420248|118.6853209 unknown
InChI: InChI=1S/C11H12N6O2S/c1-20-11-8-9(12-4-13-11)17(5-14-8)16-10(19)6-2-3-7(18)15-6/h4-6,15-16H,2-3H2,1H3
charge 0 multiplicity 1
32 atoms
S  5.378001 0.589079 -0.360333
O  -5.761828 -1.197801 -1.514771
O  -1.453308 1.163184 -1.31581
N  -4.057955 0.288594 -0.833385
N  -0.873196 1.012118 0.945742
N  0.490099 1.167491 0.712531
N  2.462938 2.165448 0.131478
N  1.218103 -1.206439 0.775617
N  3.601641 -1.432823 0.245068
C  -3.207198 0.569856 0.321773
C  -3.321032 -0.744133 1.174148
C  -4.687824 -1.338261 0.752636
C  -4.931507 -0.78307 -0.66709
C  -1.776934 0.92343 -0.127905
C  1.418669 0.121533 0.584707
C  2.641873 0.769688 0.239965
C  1.170036 2.366785 0.411685
C  3.763268 -0.087677 0.072296
C  2.366875 -1.921634 0.580691
C  6.38626 -0.999005 -0.447561
H  -3.595282 1.434893 0.90477
H  -3.257208 -0.542504 2.257688
H  -2.503749 -1.434697 0.899302
H  -5.513038 -1.005759 1.40947
H  -4.702271 -2.438999 0.729868
H  -3.950014 0.787435 -1.718397
H  -1.133267 0.680149 1.878287
H  0.657216 3.325663 0.410362
H  2.295409 -3.005408 0.706004
H  5.96701 -1.661701 -1.216671
H  6.370073 -1.50365 0.527894
H  7.405443 -0.678083 -0.712456
