program: Gaussian 09
title: 000296361
version: EM64L-G09RevD.01
frameworkgroup: C1[X(C5H9N5)]
method: RPBEPBE
basis: SDD
operation: Freq
keyword: #p
keyword: freq=noraman
keyword: PBEPBE/SDD
title: #p freq=noraman PBEPBE/SDD
converged: NO NO NO NO
title: Mulliken charges:
elementType: N N N N N C C C C C H H H H H H H H H
charge: -0.109626 -0.126784 -0.084638 -0.090449 -0.586196 0.154238 -0.602190 -0.607054 0.058476 -0.320607 0.201036 0.252552 0.253031 0.249082 0.204072 0.249253 0.241349 0.335686 0.328767
chargesum: 0.00000
title: Mulliken charges with hydrogens summed into heavy atoms:
elementType: N N N N N C C C C C
charge: -0.109626 -0.126784 -0.084638 -0.090449 0.078258 0.154238 0.104430 0.095354 0.058476 -0.079258
polarizability: 1.30113312e+02 2.34980972e+00 9.49155600e+01 1.28694220e-02 5.11058350e-04 4.74686814e+01
1716.lowfreq: -92.4417 -57.8604 -3.2321 0.0004 0.0007 0.0008 16.7517 17.2644 101.5467
frequency: -92.4320 -57.7427 101.5432 126.0782 194.7833 203.6462 257.8788 352.8138 377.6972 453.8819 502.1893 521.0425 550.5905 556.0314 579.8204 716.4442 742.0976 797.9230 881.8860 912.9632 962.0140 964.0725 1055.9736 1061.5459 1106.0956 1120.7220 1174.6691 1240.2274 1258.5592 1290.8170 1356.0704 1423.2372 1429.2965 1437.9200 1447.1127 1460.5698 1462.3383 1484.6474 1490.7644 1523.3149 1565.2283 1618.5843 2986.0797 2993.7937 3064.4590 3072.9831 3109.0676 3117.6076 3150.8954 3549.8764 3708.8716
redmass: 1.0838 1.0722 2.7237 4.6473 3.3040 6.5552 4.2348 2.9855 3.0793 2.4138 1.3635 4.0522 5.0180 1.0316 6.0493 11.2213 6.5845 11.2976 5.9088 7.8406 1.4568 2.2985 1.5948 1.9954 1.2344 1.3390 2.6229 4.8679 4.3230 5.4134 1.5471 1.8585 1.2470 2.1046 1.0399 1.0459 2.2803 1.1037 1.2155 3.2683 2.6480 1.9634 1.0336 1.0348 1.1005 1.1017 1.1015 1.1000 1.0928 1.0444 1.1056
irintensity: 0.2478 0.1018 2.6525 3.8808 2.8808 4.9644 4.2121 0.9404 11.8045 44.3437 264.1817 5.7704 1.3896 0.4186 6.6742 0.0428 2.3924 27.7392 0.9428 9.2108 8.3346 10.7485 22.7795 0.8755 0.0006 1.0970 7.0888 7.9888 13.4466 1.6923 30.5908 122.6891 57.9431 56.7706 0.0015 21.6231 76.9662 11.0749 35.2434 407.8423 808.7154 276.1293 49.0292 63.4677 18.3405 33.6517 7.7786 40.4572 26.4529 97.9476 47.5408
temp: 298.150 k
press: 1.00000 atm
elementType: 7 7 7 7 7 6 6 6 6 6 1 1 1 1 1 1 1 1 1
symmnumber: 1
zpe: 397858.4 jmol-1
zpe.correction: 0.151536 hartree
zpe.thermalcorrener: 0.160022 hartree
zpe.thermalcorrenthalpy: 0.160966 hartree
zpe.thermalcorrgfe: 0.118089 hartree
zpe.sumelectzpe: -468.943239 hartree
zpe.sumelectthermal: -468.934753 hartree
zpe.sumelectthermalent: -468.933809 hartree
zpe.sumelectthermalfe: -468.976686 hartree
dipole: 1.3063 -2.6814 -0.0032
dipole: 2.9827
quadrupole: -47.1237 -56.0641 -61.1727
quadrupole: 4.5634 0.0135 0.0048
quadrupole: 7.6632 -1.2773 -6.3859 4.5634 0.0135 0.0048
hfenergy: -469.0947755 hartree
pointgroup: C01 [X(C5H9N5)]
dipole: -0.5453807 1.0390368 -0.0001929 debye
dipolederiv: -1.4844169 0.1543927 0.0005623 0.2731983 -0.5361231 -0.0000375 -0.0032874 0.0002695 -0.3022754 -1.609455 -0.216484 -0.0004732 -0.2789681 -0.5355616 -0.000196 -0.0004128 -0.0003559 -0.2412326 -1.214083 0.0862257 0.0001083 0.5990482 -0.7472881 -0.0005487 0.0006147 -0.0005504 -0.1895183 -0.8615643 -0.0228856 0.0001137 -0.5367549 -1.080189 -0.0010332 -0.0006467 -0.0008565 -0.2129732 -0.9674432 -0.5889209 -0.0010531 -0.7892814 -0.7744704 -0.000633 -0.0027617 -0.0015941 -0.7123873 2.0583722 -0.2055875 0.0000669 -0.3382486 0.6158651 0.0003075 0.0004251 0.0002983 0.2065771 0.4675731 0.1536563 -0.0004109 0.255938 0.2835039 -0.0012021 0.000909 -0.0013942 0.2045756 0.2412531 -0.1152853 -0.0001254 -0.2439238 0.4425791 0.0007975 0.0006017 0.0006188 0.2088435 1.6405151 0.5209065 0.0010581 0.7490392 1.270885 0.0015244 0.0017788 0.0016067 0.2095099 1.2399864 0.0942506 0.0000557 0.1241686 0.7162291 0.0008174 0.0001947 0.0008738 -0.0263068 -0.136271 0.056998 -0.0008229 0.1622971 0.0353158 0.0009111 -0.0007875 0.0006958 0.1145579 0.0621874 0.0031692 -0.0337746 -0.1103608 -0.0085795 0.0880697 0.0341638 0.1040565 -0.0604379 0.0639214 0.0042628 0.034733 -0.1088708 -0.0089468 -0.0881724 -0.0324116 -0.1034196 -0.0583797 0.0846298 -0.0569849 -0.0755279 0.0580832 -0.0338888 -0.0624299 -0.0187107 -0.1057671 -0.0632878 -0.1859519 0.0554074 -0.0004261 -0.0329746 0.0913 -0.0002007 -0.0005319 -0.0000945 0.1146411 0.08481 -0.0577952 0.0757288 0.0570843 -0.0340168 0.0624614 0.0195497 0.1052952 -0.0618463 0.0690115 0.0539455 0.0000446 0.0605371 -0.0999861 -0.0002073 0.0000951 -0.0002442 0.1002009 0.2689197 0.0455208 0.0002075 0.0282905 0.1805407 -0.0002662 0.0007733 0.0000337 0.3874344 0.1780057 0.0352079 -0.0000648 0.0716984 0.2228316 0.0000379 0.0004446 0.0005281 0.382305 unknown
polarizability: 129.9404965|3.4021363|95.0883252|-0.0045618|0.0493492|47.4687313 unknown
InChI: InChI=1S/C5H9N5/c1-10(2)5-8-3-7-4(6)9-5/h3H,6H2,1-2H3
charge 0 multiplicity 1
19 atoms
N  -1.896147 0.258133 0.00029
N  0.35722 0.936865 0.001601
N  -0.257054 -1.439207 -0.000578
N  2.094168 -0.794486 0.000026
N  2.633888 1.487334 0.003126
C  -0.569818 -0.084367 0.000639
C  -2.920554 -0.804508 0.000071
C  -2.274242 1.68316 0.002665
C  1.661986 0.521576 0.001197
C  1.076231 -1.699891 -0.000796
H  -3.916062 -0.332905 -0.004455
H  -2.823906 -1.449952 0.890764
H  -2.818012 -1.45461 -0.886448
H  -1.872954 2.198674 0.893601
H  -3.373011 1.757576 0.000831
H  -1.869756 2.202214 -0.884705
H  1.366596 -2.755678 -0.002007
H  3.61036 1.202533 0.001896
H  2.366269 2.46864 0.002982
