program: Gaussian 09
title: 000296375
version: EM64L-G09RevD.01
frameworkgroup: C1[X(C17H14N2O4)]
method: RPBEPBE
basis: SDD
operation: Freq
keyword: #p
keyword: freq=noraman
keyword: PBEPBE/SDD
title: #p freq=noraman PBEPBE/SDD
converged: YES YES NO NO
title: Mulliken charges:
elementType: O O O O N N C C C C C C C C C C C C C C C C C H H H H H H H H H H H H H H
charge: -0.243811 -0.246070 -0.205090 -0.202480 -0.437291 0.027359 0.517639 0.480216 0.316252 -0.378923 -0.381466 -0.356586 -0.462245 -0.279816 0.099743 -0.311139 -0.316642 -0.332906 0.379166 -0.380043 -0.368417 0.218822 -0.797181 0.228903 0.242687 0.312229 0.224752 0.272863 0.232337 0.291907 0.209963 0.287223 0.288645 0.315165 0.240221 0.273543 0.240473
chargesum: 0.00000
title: Mulliken charges with hydrogens summed into heavy atoms:
elementType: O O O O N N C C C C C C C C C C C C C C C C C
charge: -0.243811 -0.246070 -0.205090 -0.202480 -0.122127 0.027359 0.517639 0.480216 0.316252 -0.150021 -0.138779 -0.044357 -0.237493 -0.006953 0.099743 -0.101176 -0.084305 -0.041000 0.379166 -0.092820 -0.079772 0.218822 -0.042944
polarizability: 5.47277075e+02 1.24770504e+01 2.32825062e+02 3.29812112e+00 2.26426756e+00 8.64129093e+01
1716.lowfreq: -64.4952 -2.3888 -0.0009 -0.0006 0.0002 2.3786 8.5649 12.1892 22.2693
frequency: -64.4937 12.1601 22.2312 29.7493 43.3205 62.6187 70.1182 80.5077 103.1965 108.7665 141.0404 165.1864 172.7009 223.7088 234.5368 257.9436 288.4918 314.6821 342.5184 376.3949 386.0968 406.8365 414.1655 457.1038 489.6342 492.5623 517.7627 522.8452 535.8156 580.9749 621.5916 624.6305 637.2832 652.7461 654.4329 679.8235 682.2024 738.3860 761.4542 768.4776 798.6628 827.6003 828.9918 847.9361 858.8968 877.0420 882.7188 894.8401 928.7419 957.3705 983.6673 987.7251 999.2282 1002.1853 1004.8475 1015.3525 1018.0423 1032.3441 1035.6601 1091.9984 1110.3269 1127.3141 1180.0476 1191.3635 1210.4392 1216.0890 1221.5883 1227.1403 1273.6734 1287.7424 1304.7087 1327.5353 1337.9763 1364.6185 1371.6191 1378.2984 1401.1828 1409.7691 1428.2334 1448.3223 1467.8587 1474.9979 1489.9514 1509.5252 1518.4792 1576.2279 1592.9652 1605.9980 1617.9328 1632.9559 1640.4891 2988.6343 3073.4728 3094.9765 3115.0468 3138.8161 3141.7029 3145.8423 3150.8269 3163.1150 3165.6866 3185.1164 3187.9941 3196.8761 3516.3638
redmass: 1.0534 5.1107 4.8310 7.4052 5.5790 7.3952 5.6641 6.3211 5.5127 5.7081 3.5101 7.3245 6.3894 3.5902 6.3469 5.5991 8.4601 7.2173 4.1261 3.6532 6.0751 2.8464 2.8818 3.9431 8.2809 5.6894 5.3096 2.4528 4.7626 2.8872 6.0751 7.0731 6.4450 4.9817 1.2066 4.4586 4.9805 3.4570 7.3913 3.8913 7.0182 5.0352 1.4094 1.3580 1.4698 1.7002 4.4395 1.8040 6.5782 1.3647 1.7130 1.3797 1.3316 3.3210 2.6057 1.2529 1.3622 1.6687 3.3297 3.1882 1.3332 1.3995 1.2938 1.2337 3.0479 3.1285 3.6881 1.6445 1.9311 1.3347 1.6028 1.6223 2.2757 6.1422 3.2595 1.2406 10.6984 4.0128 3.5026 1.2148 1.0466 2.3575 1.9170 4.0689 4.8147 4.7378 7.5535 6.3233 5.5603 5.5513 5.3862 1.0386 1.0983 1.0892 1.0884 1.0979 1.0917 1.0952 1.0902 1.0895 1.0878 1.0952 1.0965 1.0949 1.0765
irintensity: 0.0511 0.5534 3.0969 0.0694 0.0372 0.2565 14.0586 0.8580 2.2428 3.7220 0.7770 0.0822 0.1671 0.9357 7.5657 0.5155 1.8314 12.6532 8.0748 0.0265 1.0015 0.0493 0.0312 1.5264 11.7383 4.5592 1.0730 38.6716 1.1558 1.1879 34.2259 0.3209 12.3870 8.1162 55.2657 16.9744 13.2314 3.3224 62.7745 0.1994 15.4885 0.3206 58.5110 4.2822 82.1851 11.3554 8.1420 12.3748 7.6269 6.1768 58.7115 6.2418 10.0715 27.9579 3.9353 28.3218 1.3899 8.5706 120.4089 15.0308 25.7267 13.5333 6.6688 304.2696 551.5855 222.8933 54.7916 11.0879 75.3888 12.0195 101.8671 43.3593 19.2767 196.3895 458.4520 97.1719 8.6487 37.0824 127.7128 28.6665 20.9931 1.2736 164.4735 962.4177 4.8972 165.6494 50.6020 4.4957 403.7315 186.5851 90.4322 6.9249 13.1211 1.0304 22.6670 6.5190 11.4025 8.0100 5.9537 4.4520 12.4610 0.9350 1.9474 4.8254 22.7755
temp: 298.150 k
press: 1.00000 atm
elementType: 8 8 8 8 7 7 6 6 6 6 6 6 6 6 6 6 6 6 6 6 6 6 6 1 1 1 1 1 1 1 1 1 1 1 1 1 1
symmnumber: 1
zpe: 722295.6 jmol-1
zpe.correction: 0.275108 hartree
zpe.thermalcorrener: 0.295132 hartree
zpe.thermalcorrenthalpy: 0.296076 hartree
zpe.thermalcorrgfe: 0.222336 hartree
zpe.sumelectzpe: -1064.923308 hartree
zpe.sumelectthermal: -1064.903284 hartree
zpe.sumelectthermalent: -1064.902340 hartree
zpe.sumelectthermalfe: -1064.976080 hartree
dipole: -10.4901 2.4832 -0.1295
dipole: 10.7808
quadrupole: -128.0332 -145.1557 -136.6259
quadrupole: -6.5920 1.1001 0.5757
quadrupole: 8.5717 -8.5507 -0.0210 -6.5920 1.1001 0.5757
hfenergy: -1065.198416 hartree
pointgroup: C01[X(C17H14N2O4)]
dipole: 4.1398532 -0.9163667 0.1095636 debye
polarizability: 546.867478|17.0269534|231.4940499|3.2164504|-15.8927296|88.1535181 unknown
InChI: InChI=1S/C17H14N2O4/c1-12(20)18-15-7-2-13(3-8-15)4-11-17(21)14-5-9-16(10-6-14)19(22)23/h2-11,18H,1H3
charge 0 multiplicity 1
37 atoms
O  -1.748962 -2.804509 0.228277
O  6.112088 2.602801 -0.033949
O  -6.71038 2.584858 -0.462699
O  -7.806316 0.630726 -0.034297
N  6.243966 0.260164 0.102059
N  -6.728281 1.317447 -0.214998
C  2.162044 -1.022183 0.124384
C  4.878596 -0.118446 0.106802
C  -2.960274 -0.735462 0.025918
C  2.483392 0.366759 0.054063
C  3.247423 -1.946452 0.185946
C  3.809514 0.823519 0.04446
C  4.579188 -1.508435 0.177841
C  0.797673 -1.540791 0.136431
C  -1.676442 -1.533577 0.11742
C  -0.37776 -0.829197 0.083896
C  -3.005581 0.659461 -0.245882
C  -4.180927 -1.441442 0.212072
C  -5.426853 0.605371 -0.132129
C  -4.236747 1.337626 -0.328805
C  -5.418793 -0.781871 0.137595
C  6.80305 1.548073 0.034736
C  8.330412 1.551917 0.052627
H  1.679179 1.108876 0.006073
H  3.032059 -3.019926 0.240876
H  4.042924 1.887862 -0.010096
H  5.394129 -2.241937 0.226372
H  0.686026 -2.634191 0.195172
H  -2.086447 1.228763 -0.408266
H  -4.120988 -2.51571 0.411749
H  -0.367904 0.263504 0.030853
H  -4.293433 2.408231 -0.54105
H  -6.365868 -1.308152 0.280926
H  6.912749 -0.512997 0.154079
H  8.723241 1.092696 0.978762
H  8.67833 2.593123 0.000437
H  8.74427 0.996201 -0.809252
