program: Gaussian 09
title: 000296364
version: EM64L-G09RevD.01
frameworkgroup: C1[X(C13H13NO4)]
method: RPBEPBE
basis: SDD
operation: Freq
keyword: #p
keyword: freq=noraman
keyword: PBEPBE/SDD
title: #p freq=noraman PBEPBE/SDD
converged: YES YES NO NO
title: Mulliken charges:
elementType: O O O O N C C C C C C C C C C C C C H H H H H H H H H H H H H
charge: -0.264479 -0.231959 -0.229495 -0.293760 -0.395410 0.169967 0.361266 0.070517 0.111869 -0.528217 -0.376022 -0.345815 0.360185 -0.376803 0.177004 -0.258874 -0.670420 -0.535622 0.325079 0.255462 0.282799 0.293820 0.247203 0.224477 0.228965 0.212401 0.246657 0.236322 0.226967 0.249003 0.226913
chargesum: 0.00000
title: Mulliken charges with hydrogens summed into heavy atoms:
elementType: O O O O N C C C C C C C C C C C C C
charge: -0.264479 -0.231959 -0.229495 -0.293760 -0.070331 0.169967 0.361266 0.070517 0.111869 -0.272755 -0.093223 -0.051995 0.360185 -0.129600 0.177004 0.194568 0.024959 0.167261
polarizability: 2.86439191e+02 -1.31901358e+00 1.62822317e+02 -3.58191088e+00 2.94362718e+00 8.01395621e+01
1716.lowfreq: -9.7573 -6.4392 -3.0799 -0.0005 -0.0001 0.0006 13.3458 34.9190 59.2840
frequency: 13.1392 34.8407 59.2825 77.6888 86.3142 108.1559 113.4974 181.2546 204.7743 215.7946 219.2361 244.9734 270.3664 298.7645 316.5386 320.9920 371.0806 387.8590 423.1219 440.4247 502.7094 503.1548 539.4405 569.8758 582.9343 611.3824 646.4231 664.2068 697.2897 718.0160 726.7079 785.0475 793.6257 819.6074 827.7909 836.6430 859.1373 902.5850 907.2481 960.6813 988.3817 998.4470 1007.6763 1080.2336 1095.2731 1110.5244 1114.6446 1137.9482 1155.5648 1168.2538 1179.0351 1238.7487 1260.7149 1278.4873 1282.3475 1292.6712 1348.1209 1362.9800 1389.7072 1400.7352 1412.0030 1436.0325 1453.9583 1462.0002 1467.2755 1471.6542 1476.0893 1485.5395 1520.6320 1552.2810 1560.4870 1582.9737 1623.7068 1640.0481 2968.1271 2992.1608 3029.1594 3059.9698 3087.6857 3094.8032 3120.4387 3131.1232 3148.5523 3150.7206 3161.3119 3171.9385 3555.9897
redmass: 5.2467 3.7757 4.5854 4.1178 4.2882 3.9837 3.8281 3.0107 3.0333 1.3227 1.5545 4.2308 4.1918 3.0176 5.4803 5.8614 6.0899 6.9234 3.2292 3.7658 3.7333 5.8026 4.8504 6.7005 6.2607 2.0509 1.8905 4.3398 4.7441 5.8833 4.6766 2.5943 2.5983 1.7080 3.7701 2.0512 1.7815 5.4341 4.9377 1.3781 1.3395 3.5725 2.8289 4.2367 2.1598 1.2585 2.6946 1.5137 1.6992 1.4293 1.7877 2.8278 1.5365 1.1280 3.7479 2.3393 1.8222 1.8321 1.2377 3.2988 4.9743 1.2083 1.1223 1.0444 1.0502 1.0576 3.4523 1.0519 3.3348 8.4142 6.4010 4.5416 7.7705 6.5983 1.0325 1.0362 1.0596 1.1045 1.0973 1.1026 1.1061 1.1001 1.0919 1.0886 1.0938 1.0955 1.0781
irintensity: 4.4221 0.6568 0.8753 0.9620 0.2107 7.9073 8.4058 5.7526 0.6961 0.5125 5.0215 2.1555 2.0754 13.9376 1.5288 7.9888 3.3128 0.9927 8.3951 5.5827 1.2425 3.8407 11.5809 19.1795 6.6890 31.0720 73.2761 2.8446 5.4848 3.0847 10.7621 0.5170 21.5242 8.4659 1.5506 11.9366 58.8322 36.1235 0.1957 8.1518 1.9112 66.4860 13.2812 284.2330 23.1140 0.2140 107.1907 7.2316 66.0812 12.2316 257.0516 134.0066 35.2927 1.0448 129.4766 116.1982 1.1562 42.4714 22.9783 3.6786 48.0088 8.5757 46.5522 16.1118 14.9134 43.2473 218.5525 15.9947 18.9459 140.1105 211.2991 69.6928 430.8510 168.2200 68.2226 25.7480 38.8212 42.2335 42.2062 2.6813 29.1583 23.3342 2.4528 1.1489 2.2263 12.3646 62.7566
temp: 298.150 k
press: 1.00000 atm
elementType: 8 8 8 8 7 6 6 6 6 6 6 6 6 6 6 6 6 6 1 1 1 1 1 1 1 1 1 1 1 1 1
symmnumber: 1
zpe: 625346.5 jmol-1
zpe.correction: 0.238182 hartree
zpe.thermalcorrener: 0.254947 hartree
zpe.thermalcorrenthalpy: 0.255891 hartree
zpe.thermalcorrgfe: 0.191919 hartree
zpe.sumelectzpe: -857.532886 hartree
zpe.sumelectthermal: -857.516121 hartree
zpe.sumelectthermalent: -857.515177 hartree
zpe.sumelectthermalfe: -857.579149 hartree
dipole: -5.0529 2.0802 0.1952
dipole: 5.4678
quadrupole: -78.7926 -98.3877 -106.6175
quadrupole: 2.0923 -0.8504 -0.4447
quadrupole: 15.8066 -3.7884 -12.0182 2.0923 -0.8504 -0.4447
hfenergy: -857.7710681 hartree
pointgroup: C01 [X(C13H13N1O4)]
dipole: -1.9772052 -0.8182401 -0.2209141 debye
polarizability: 286.4318213|3.2989921|157.5199096|-0.263701|20.592844|85.4493387 unknown
InChI: InChI=1S/C13H13NO4/c1-3-18-13(16)10-7-14-11-6-8(17-2)4-5-9(11)12(10)15/h4-7,14H,3H2,1-2H3
charge 0 multiplicity 1
31 atoms
O  -5.012518 -0.316538 -0.155869
O  3.52933 0.760946 0.440077
O  1.020346 1.960934 0.482368
O  3.662171 -1.383769 -0.459281
N  -0.445869 -1.809705 -0.510584
C  -0.857678 0.50352 0.106703
C  -1.370209 -0.782322 -0.24249
C  0.612072 0.78971 0.194877
C  1.47919 -0.380929 -0.091819
C  -2.758352 -1.028509 -0.323086
C  -1.792189 1.534639 0.371189
C  0.906822 -1.603182 -0.43522
C  -3.659916 0.021811 -0.051806
C  -3.176835 1.316614 0.298606
C  2.970293 -0.396783 -0.071194
C  5.02369 0.823723 0.456745
C  5.553708 1.32508 -0.89011
C  -6.00465 0.731498 0.111788
H  -0.799403 -2.733458 -0.764181
H  -3.15762 -2.012524 -0.590659
H  -1.38417 2.516071 0.635091
H  1.559724 -2.451943 -0.661889
H  -3.868667 2.136638 0.50933
H  5.23556 1.532168 1.273145
H  5.421645 -0.1774 0.699345
H  6.648121 1.47397 -0.829589
H  5.347872 0.592876 -1.68878
H  5.08572 2.288148 -1.156365
H  -5.921523 1.106138 1.149708
H  -6.979055 0.242406 -0.030064
H  -5.900708 1.572373 -0.59999
