program: Gaussian 09
title: 000027266
version: EM64L-G09RevD.01
frameworkgroup: C1[X(C14H14O2)]
method: RPBEPBE
basis: SDD
operation: Freq
keyword: #pfreq=noraman
keyword: PBEPBE/SDD
title: #p freq=noraman PBEPBE/SDD
converged: YES YES NO NO
title: Mulliken charges:
elementType: O O C C C C C C C C C C C C C C H H H H H H H H H H H H H H
charge: -0.409210 -0.236666 -0.314377 0.513602 -0.385784 -0.575728 0.372955 -0.464725 0.374429 -0.421642 0.152023 -0.691059 -0.426345 -0.406999 -0.243234 -0.242200 0.243379 0.231082 0.211069 0.269975 0.235626 0.236185 0.205360 0.237246 0.221020 0.243540 0.237901 0.228538 0.227890 0.376149
chargesum: 0.00000
title: Mulliken charges with hydrogens summed into heavy atoms:
elementType: O O C C C C C C C C C C C C C C
charge: -0.033061 -0.236666 -0.070998 0.513602 0.056367 -0.305753 0.372955 -0.229099 0.374429 -0.185457 0.152023 -0.027432 -0.182805 -0.169098 -0.014697 -0.014310
polarizability: 2.25027263e+02 1.00191332e+01 1.35696046e+02 -6.78836018e+00 -2.79685082e+01 1.18272294e+02
1716.lowfreq: -3.2881 -0.0010 -0.0010 -0.0007 4.9093 19.1292 33.7751 39.2333 57.9529
frequency: 33.5979 39.2084 57.9313 91.6227 119.9388 151.8592 160.2215 183.8619 222.5676 279.0994 306.4700 342.0655 377.1883 401.3573 416.1101 480.1215 492.7292 512.2214 544.7793 600.6780 606.3230 630.4145 663.7675 679.0510 734.4113 758.5279 760.5249 788.2988 803.0554 831.5927 869.6515 873.5921 896.8853 918.3475 940.5431 950.8779 961.6214 976.7637 992.2345 1022.1750 1038.5967 1054.6404 1087.1405 1114.2810 1127.3243 1156.1143 1171.7933 1176.3162 1225.9619 1234.5921 1240.2565 1258.0471 1276.9531 1309.8518 1317.9702 1350.2683 1372.3054 1392.5598 1408.1624 1426.2582 1435.0968 1462.9134 1469.1568 1475.9051 1483.3139 1515.1236 1580.8541 1603.1621 1640.0287 1655.3332 2978.7698 2992.3259 3034.4729 3052.8075 3076.2446 3084.6692 3119.0333 3119.9984 3125.4234 3127.4998 3142.4132 3143.7761 3161.6421 3501.3754
redmass: 4.1682 7.5541 4.3620 3.1160 3.1757 3.8620 2.7401 3.7008 1.3948 3.7840 4.0979 4.2451 4.2292 3.3150 3.8523 2.5356 3.6966 6.8384 3.4319 2.4684 2.7115 4.1055 2.6231 2.6945 2.4224 1.7926 2.6313 2.7469 1.7468 1.3816 2.1433 1.5905 3.7158 2.2026 2.0831 3.4992 1.4641 1.4095 1.3465 2.2708 1.9226 2.2797 2.0747 2.1098 1.7011 1.5967 1.1326 1.3041 1.6223 1.6501 1.4152 1.4852 1.7698 1.4547 1.5675 1.6506 1.6093 1.2103 4.8344 4.7659 2.7055 2.1038 1.1421 1.0420 1.0631 3.6619 7.1954 5.4594 6.6909 8.2606 1.0363 1.0622 1.0878 1.0962 1.0991 1.1006 1.0866 1.0858 1.0895 1.0906 1.0953 1.0973 1.1004 1.0638
irintensity: 0.2271 2.3053 0.7063 0.8130 0.1801 0.9654 0.3200 1.4639 0.1765 0.3617 0.7402 6.8597 2.8791 0.4508 2.0840 15.7427 15.7641 0.0198 7.6782 54.1731 58.9000 9.9482 21.4656 45.5743 30.1675 33.0428 19.0065 0.0811 12.9767 54.2014 1.3506 26.6246 1.7964 21.1482 4.9090 7.1297 1.9624 7.6234 0.0498 4.2467 186.4422 80.3848 16.0567 30.5761 7.2700 9.3860 0.3505 1.5777 1.5062 1.9218 3.5291 3.5675 6.1038 2.9111 39.0831 30.2216 14.3943 13.4466 2.1834 0.5725 2.7232 0.1864 6.6880 8.6052 10.5829 17.0875 0.8156 13.3734 5.2981 167.8083 28.8846 32.5644 3.5012 7.8000 43.3524 60.0770 2.6410 5.7292 0.8489 2.3187 20.1580 36.7776 34.9875 21.6747
temp: 298.150 k
press: 1.00000 atm
elementType: 8 8 6 6 6 6 6 6 6 6 6 6 6 6 6 6 1 1 1 1 1 1 1 1 1 1 1 1 1 1
symmnumber: 1
zpe: 635175.3 jmol-1
zpe.correction: 0.241926 hartree
zpe.thermalcorrener: 0.256227 hartree
zpe.thermalcorrenthalpy: 0.257171 hartree
zpe.thermalcorrgfe: 0.199560 hartree
zpe.sumelectzpe: -691.217482 hartree
zpe.sumelectthermal: -691.203180 hartree
zpe.sumelectthermalent: -691.202236 hartree
zpe.sumelectthermalfe: -691.259848 hartree
dipole: -0.1485 1.1694 -0.6346
dipole: 1.3388
quadrupole: -83.3060 -92.1008 -92.8376
quadrupole: 1.8817 -2.3843 -0.9848
quadrupole: 6.1088 -2.6860 -3.4228 1.8817 -2.3843 -0.9848
hfenergy: -691.4594075 hartree
pointgroup: C01 [X(C14H14O2)]
dipole: -0.0526237 -0.432782 0.2955676 debye
polarizability: 225.2562224|-10.7769189|130.1560102|4.5811821|-28.8822228|123.5833709 unknown
InChI: InChI=1S/C14H14O2/c1-2-13(14(15)16)12-8-7-10-5-3-4-6-11(10)9-12/h3-9,13,15H,2H2,1H3
charge 0 multiplicity 1
30 atoms
O  3.498947 1.262804 1.473394
O  2.872807 2.034376 -0.623045
C  2.425037 -0.328884 -0.002038
C  0.902757 -0.36547 0.21052
C  2.845052 -0.839982 -1.41375
C  0.046521 0.455012 -0.534379
C  -1.374465 0.395954 -0.362266
C  0.343153 -1.275322 1.168007
C  -1.932746 -0.531646 0.601797
C  -1.037327 -1.35761 1.356919
C  2.932301 1.094622 0.201423
C  2.467415 -2.316665 -1.645422
C  -2.265542 1.230653 -1.116914
C  -3.35594 -0.590421 0.771383
C  -3.647326 1.151738 -0.930911
C  -4.197787 0.233213 0.020874
H  2.901121 -0.959641 0.769306
H  2.373069 -0.195211 -2.177708
H  3.939709 -0.712267 -1.525635
H  0.463895 1.168602 -1.255677
H  1.01647 -1.910417 1.755602
H  -1.452834 -2.058681 2.090644
H  2.959887 -2.977713 -0.907213
H  1.376704 -2.469758 -1.5627
H  2.781972 -2.644832 -2.652502
H  -1.842775 1.934168 -1.844075
H  -3.77467 -1.293163 1.501941
H  -4.318756 1.793097 -1.512355
H  -5.283792 0.182009 0.156373
H  3.783645 2.211837 1.580707
