program: Gaussian 09
title: 000296359
version: EM64L-G09RevD.01
frameworkgroup: C1[X(C13H19NO2)]
method: RPBEPBE
basis: SDD
operation: Freq
keyword: #p
keyword: freq=noraman
keyword: PBEPBE/SDD
title: #p freq=noraman PBEPBE/SDD
converged: YES YES NO NO
title: Mulliken charges:
elementType: O O N C C C C C C C C C C C C C H H H H H H H H H H H H H H H H H H H
charge: -0.311320 -0.305184 -0.413983 0.328919 -0.604356 -0.711554 -0.774645 0.499962 -0.377001 -0.412529 0.283628 -0.241922 -0.240521 -0.245679 -0.254599 -0.662634 0.203252 0.258744 0.264127 0.216376 0.206436 0.220305 0.225335 0.246070 0.328722 0.237313 0.228159 0.224107 0.223343 0.226885 0.235569 0.218586 0.214081 0.223868 0.242140
chargesum: 0.00000
title: Mulliken charges with hydrogens summed into heavy atoms:
elementType: O O N C C C C C C C C C C C C C
charge: -0.311320 -0.305184 -0.085260 0.328919 -0.142360 -0.024615 -0.082936 0.499962 -0.139688 -0.184369 0.283628 -0.017816 -0.017178 -0.018794 0.199555 0.017455
polarizability: 1.71945950e+02 -4.83710992e+00 1.69241070e+02 -1.28080125e+01 -7.13777681e+00 1.07541915e+02
1716.lowfreq: -5.6030 -0.0008 -0.0006 -0.0005 7.2174 9.5051 27.3555 35.4401 49.4841
frequency: 26.4418 35.3023 49.4209 74.7840 77.8163 98.0835 123.0844 141.5721 206.6932 212.2789 237.4519 240.2083 270.7091 273.9551 315.7351 319.4979 374.0359 380.4704 407.8425 412.2286 457.5230 485.7173 521.4424 529.8327 606.5499 618.5359 654.5063 704.6461 710.3060 729.5722 788.5206 801.1247 817.6599 841.4398 857.8822 886.0731 902.8765 925.2378 934.2853 958.9759 978.9888 988.0909 990.4783 995.1559 1015.4752 1028.3069 1049.6758 1078.5783 1094.3156 1138.9745 1152.8365 1165.3641 1171.3003 1189.1824 1196.5402 1218.5198 1229.9610 1271.4060 1281.8517 1320.7493 1331.0861 1356.3716 1377.0359 1382.8341 1386.8086 1395.2593 1440.1633 1453.3816 1458.0462 1461.3723 1467.5513 1474.9884 1477.5104 1481.3970 1484.0460 1485.9534 1496.6910 1591.1602 1613.9839 1658.7909 2981.4853 2987.0159 2988.4740 2997.5896 3025.2934 3060.5441 3075.7984 3082.9879 3083.9450 3085.9365 3091.6561 3101.6259 3111.5736 3112.6291 3120.1013 3132.7887 3142.5442 3160.5931 3555.4825
redmass: 4.1545 3.2710 3.3708 5.0642 4.3660 3.9970 3.6281 2.6426 1.0771 1.4166 2.7863 1.6130 1.5322 3.1010 2.8875 3.2000 2.3566 3.0494 2.8660 2.6610 3.3879 2.9376 2.5989 1.2214 4.2904 6.2581 4.5874 4.8723 2.6321 2.0416 2.7158 1.2068 3.5780 3.0430 1.2511 1.8583 3.2161 1.4851 1.5701 1.8654 1.3915 2.2894 4.3493 1.3610 1.3896 2.1641 4.4812 1.6020 2.1214 1.3832 1.7035 2.2839 1.0540 1.1397 2.3426 2.4656 3.0293 1.9747 1.1109 1.5794 1.2720 1.2497 1.1996 7.0013 1.2389 1.2304 2.1146 1.1227 1.0887 1.0486 1.1544 1.1206 1.0830 1.2268 1.8625 1.2375 1.1212 5.9561 6.1222 8.3593 1.0357 1.0363 1.0357 1.0597 1.0593 1.1016 1.1002 1.0997 1.0978 1.1026 1.0989 1.1000 1.0867 1.1060 1.0859 1.0915 1.0961 1.1015 1.0771
irintensity: 0.0368 1.9250 0.2719 6.5128 2.5766 0.8225 0.9316 1.2273 0.8809 2.3319 1.1544 0.5499 1.8992 0.9085 13.3838 7.7629 2.9667 2.2223 0.3875 2.6813 4.4264 2.6568 2.9994 110.5196 4.9352 0.4118 9.8769 54.1085 19.1495 34.0712 17.9060 3.1604 3.0219 0.3364 0.1140 1.8969 18.2643 1.5141 8.1847 6.3253 0.0712 2.1839 0.5456 0.1430 0.5166 6.5924 238.2216 16.4483 37.8994 7.4219 52.2717 28.3740 0.0253 1.1105 63.1537 3.9774 170.1299 3.6632 3.7478 26.7261 1.1080 1.9825 28.9118 0.2179 26.7960 38.0466 9.6994 16.0127 32.6661 8.4176 79.2045 20.7637 17.5982 33.5529 16.0294 164.3750 26.1524 1.5092 6.2762 203.9218 18.8302 28.1546 16.3975 31.6324 39.8720 6.0300 21.5584 29.5637 49.9790 4.3277 37.3353 11.6239 10.5468 37.2678 0.7562 15.0117 44.8250 23.0461 30.3491
temp: 298.150 k
press: 1.00000 atm
elementType: 8 8 7 6 6 6 6 6 6 6 6 6 6 6 6 6 1 1 1 1 1 1 1 1 1 1 1 1 1 1 1 1 1 1 1
symmnumber: 1
zpe: 776009.0 jmol-1
zpe.correction: 0.295566 hartree
zpe.thermalcorrener: 0.312588 hartree
zpe.thermalcorrenthalpy: 0.313532 hartree
zpe.thermalcorrgfe: 0.249886 hartree
zpe.sumelectzpe: -710.780137 hartree
zpe.sumelectthermal: -710.763116 hartree
zpe.sumelectthermalent: -710.762171 hartree
zpe.sumelectthermalfe: -710.825817 hartree
dipole: -0.6622 0.1590 1.9306
dipole: 2.0472
quadrupole: -90.3017 -87.2343 -101.3646
quadrupole: -7.0016 0.5634 0.5946
quadrupole: 2.6652 5.7325 -8.3977 -7.0016 0.5634 0.5946
hfenergy: -711.0757033 hartree
pointgroup: C01 [X(C13H19N1O2)]
dipole: 0.2309532 -0.1055393 0.7643448 debye
polarizability: 170.9680985|-6.0010066|168.0188332|14.8962766|10.7341929|109.7420038 unknown
InChI: InChI=1S/C13H19NO2/c1-4-16-12(15)14-13(2,3)10-11-8-6-5-7-9-11/h5-9,14H,4,10H2,1-3H3
charge 0 multiplicity 1
35 atoms
O  -2.871449 0.277924 0.962496
O  -2.301168 -0.457578 -1.209797
N  -1.092672 -1.106465 0.710955
C  -0.066976 -1.986489 0.080611
C  0.800088 -1.181798 -0.960352
C  -0.764234 -3.158926 -0.658687
C  0.801196 -2.532712 1.237123
C  1.558809 0.009176 -0.399642
C  0.945466 1.287979 -0.321117
C  2.896917 -0.120442 0.058469
C  -2.086444 -0.446623 0.034107
C  1.640391 2.396772 0.212113
C  3.597599 0.985612 0.590833
C  2.969279 2.249867 0.673552
C  -3.954639 1.109525 0.371636
C  -3.427925 2.486743 -0.044476
H  1.507566 -1.906381 -1.406916
H  0.112367 -0.853672 -1.760852
H  -1.426646 -2.777363 -1.453537
H  -1.368968 -3.753998 0.048979
H  -0.008938 -3.823122 -1.116383
H  1.580909 -3.204648 0.838891
H  0.181973 -3.113416 1.945844
H  1.304295 -1.716933 1.786736
H  -1.03314 -0.927015 1.714607
H  -0.075907 1.415388 -0.699179
H  3.397016 -1.094833 -0.012597
H  1.149375 3.375688 0.259431
H  4.631724 0.863601 0.933279
H  3.511037 3.110384 1.0822
H  -4.383437 0.570376 -0.491575
H  -4.699188 1.181182 1.181236
H  -4.26557 3.12222 -0.388286
H  -2.93566 2.992138 0.804697
H  -2.706945 2.392442 -0.874596
