program: Gaussian 09
title: 000296330
version: EM64L-G09RevD.01
frameworkgroup: C1[X(C10H12N2O2)]
method: RPBEPBE
basis: SDD
operation: Freq
keyword: #p
keyword: freq=noraman
keyword: PBEPBE/SDD
title: #p freq=noraman PBEPBE/SDD
converged: YES YES NO NO
title: Mulliken charges:
elementType: O O N N C C C C C C C C C C H H H H H H H H H H H H
charge: -0.281151 -0.245346 -0.351439 -0.008675 -0.544017 0.509022 -0.608173 0.230389 -0.307374 -0.358527 0.278840 -0.339190 -0.322499 -0.763039 0.225698 0.260317 0.354557 0.271504 0.263785 0.268801 0.230877 0.262489 0.243293 0.251376 0.239614 0.238871
chargesum: 0.00000
title: Mulliken charges with hydrogens summed into heavy atoms:
elementType: O O N N C C C C C C C C C C
charge: -0.281151 -0.245346 0.003118 -0.008675 -0.058003 0.509022 -0.072884 0.230389 -0.038573 -0.127650 0.278840 -0.099576 -0.083628 -0.005881
polarizability: 1.43798830e+02 1.56521802e+01 1.04680504e+02 7.58549159e+00 9.22848298e+00 1.17863572e+02
1716.lowfreq: -11.2527 -5.3548 -3.5375 0.0004 0.0007 0.0008 19.7764 23.7712 44.9133
frequency: 18.4651 23.6992 44.8848 67.3734 78.8989 143.7202 150.2659 198.0225 248.0903 271.2607 317.3810 352.8365 367.3171 406.4721 451.8974 490.0771 552.9518 554.4978 620.7530 661.8482 684.3677 751.5611 782.5440 801.8391 811.4890 841.9833 850.7619 890.9609 892.8446 959.1426 964.3074 967.2005 983.1366 1008.1731 1024.5322 1064.1256 1069.8323 1090.3200 1166.5602 1181.2357 1214.1817 1223.3486 1244.1891 1249.0934 1308.7971 1311.7590 1336.7206 1354.3564 1373.6231 1404.9171 1414.8964 1440.4776 1452.2225 1454.2331 1466.1385 1522.3316 1560.7321 1587.5109 1604.7062 1632.3231 2976.1133 2982.6963 3010.2280 3065.6735 3071.9879 3076.7742 3122.1750 3127.5432 3130.9935 3145.4147 3158.2126 3365.4084
redmass: 4.3111 4.0442 5.3152 3.4660 4.1729 1.2053 4.7925 4.1434 5.7404 4.7305 2.8135 3.2655 2.4883 4.0828 2.2292 4.4039 3.8665 3.6513 4.0894 6.8737 3.8845 3.6078 1.3845 1.9006 2.9352 1.8442 1.9642 2.3104 1.2921 6.6618 1.4121 1.8650 1.4599 2.1970 1.8399 2.4764 4.0015 1.5715 1.5075 1.6608 1.8049 1.7195 2.0338 1.6565 1.9489 4.4269 1.2713 1.2882 1.2465 2.0170 1.0886 1.0724 1.0565 1.1528 1.8391 1.8131 6.5315 5.5438 7.0478 5.8518 1.0655 1.0400 1.0591 1.0951 1.1040 1.0913 1.0874 1.1004 1.0888 1.0972 1.0982 1.0814
irintensity: 0.1128 1.7824 0.3114 1.8359 15.7742 2.0819 6.5591 4.0265 16.7072 0.2436 0.4789 2.8085 0.0893 7.4478 1.0653 30.3218 16.5975 7.7958 20.8370 0.3842 14.4127 3.8832 56.2812 49.0526 0.6076 28.1005 30.4268 1.3248 0.5815 3.7007 0.5618 9.5492 0.6593 3.3126 16.5240 5.2278 2.1510 2.1397 43.4883 8.6882 1.7773 8.8071 93.6852 12.7898 60.0060 3.2885 4.1400 13.0639 70.3039 28.6375 55.6583 23.1025 18.5944 22.8652 2.9814 297.1613 15.7969 49.2215 37.9912 235.1022 1.3807 1.3687 35.0399 8.7750 6.9611 4.6988 7.6365 9.8117 18.0617 33.8844 3.9335 219.3710
temp: 298.150 k
press: 1.00000 atm
elementType: 8 8 7 7 6 6 6 6 6 6 6 6 6 6 1 1 1 1 1 1 1 1 1 1 1 1
symmnumber: 1
zpe: 539500.3 jmol-1
zpe.correction: 0.205485 hartree
zpe.thermalcorrener: 0.219100 hartree
zpe.thermalcorrenthalpy: 0.220044 hartree
zpe.thermalcorrgfe: 0.162080 hartree
zpe.sumelectzpe: -647.189058 hartree
zpe.sumelectthermal: -647.175443 hartree
zpe.sumelectthermalent: -647.174499 hartree
zpe.sumelectthermalfe: -647.232463 hartree
dipole: 4.4839 -0.6235 -1.4331
dipole: 4.7485
quadrupole: -76.8671 -93.6026 -77.2840
quadrupole: -5.7333 11.2094 -3.7748
quadrupole: 5.7175 -11.0180 5.3005 -5.7333 11.2094 -3.7748
hfenergy: -647.3945432 hartree
pointgroup: C01 [X(C10H12N2O2)]
dipole: -1.6559285 -0.2229075 -0.8356614 debye
dipolederiv: -0.710868 0.1110647 -0.1371912 -0.0340357 -0.5056449 0.2728714 0.1340689 0.2817201 -0.9118068 -0.7328488 0.1139934 0.185681 0.2118693 -0.4802201 0.1366369 0.1401355 0.1278478 -0.7076713 -1.0971972 -0.0961618 0.1967424 0.0428214 -0.5172725 -0.0593554 0.1881196 0.0522022 -0.6670975 -0.3555043 -0.0436546 0.0207134 -0.0811482 -0.3051772 -0.0370465 0.0225982 -0.0295339 -0.3393661 0.5408738 0.0130822 -0.0240496 -0.1199873 0.2686985 0.1129024 0.1398709 0.1109903 0.1978108 0.1759225 0.1801065 -0.0057923 0.258848 0.0777229 0.0127596 0.0112996 0.0492485 0.0936556 -0.3952824 0.1860608 -0.1051117 0.2237942 -0.2842656 0.3208153 -0.1967275 0.2726439 -0.1632783 1.3466023 -0.2257231 -0.0415962 -0.0754509 0.3392229 -0.3507301 -0.4390429 -0.3720684 1.1548425 -0.1148443 -0.0641802 -0.1163167 -0.0962901 -0.2105179 -0.1415929 -0.1127169 -0.0859477 -0.159944 -0.3036612 -0.091292 0.0451783 -0.1804212 -0.1522648 0.1120949 -0.052687 0.0480649 0.0139991 0.704335 -0.326226 -0.2822727 -0.5431897 0.7852102 -0.3359479 -0.1560833 -0.3119953 0.7356733 0.0683381 0.1283363 0.015232 0.0899127 0.1014474 0.2244752 -0.080085 0.1093696 0.2753738 0.2231218 0.1259421 -0.2031337 0.2016584 0.0715351 -0.0439496 -0.0808517 0.0539887 0.1534968 -0.2850228 0.2475486 0.0641291 0.3652608 -0.2427696 -0.0154045 0.1357487 -0.0943337 -0.0208723 -0.0414998 0.0378917 0.0614389 0.016511 0.0543338 -0.0584189 0.0437125 -0.1416636 -0.0641344 0.0545968 -0.0686429 0.0110542 0.0102121 0.0256598 0.0171454 -0.0959197 0.0899184 0.0345296 0.370479 -0.0617092 0.0891148 -0.15427 0.3657603 0.0115154 0.2001147 -0.0286392 0.270466 0.0764726 -0.0441203 -0.0193095 -0.059959 0.0507953 -0.0277238 -0.053024 -0.0317645 0.0753174 0.0360906 0.0685676 0.0120215 0.0792321 0.0782158 -0.0407948 0.0722 -0.030379 -0.0036487 0.0803282 -0.0326926 0.0992372 -0.0235429 0.1093962 0.0279237 0.0927806 0.0076059 0.0670957 0.125164 -0.0297299 0.0028874 -0.004014 0.0688994 -0.1167798 0.0313749 -0.0945731 -0.0564857 0.0808275 0.0258193 0.0057623 0.0550044 0.0526066 0.0810052 -0.0481575 0.1051144 -0.0185739 -0.0087359 -0.0592851 0.040359 -0.1098515 0.0274185 0.0322724 0.0194241 0.0606971 0.1159181 0.0837373 -0.0258879 -0.0616443 0.0124367 0.0600954 -0.062199 -0.0556646 -0.0753886 0.0053462 0.0932805 -0.0176209 0.0286237 -0.016974 0.0677806 -0.0969882 0.0279417 -0.0864356 -0.0748069 -0.0147052 -0.0514865 0.1182429 -0.0684266 0.0933338 0.0245136 0.1115703 0.0133107 -0.0058392 unknown
polarizability: 145.909074|11.7964129|101.6354512|-11.7910195|2.7091131|118.7983796 unknown
InChI: InChI=1S/C10H12N2O2/c1-8(13)6-10(14)12-7-9-2-4-11-5-3-9/h2-5,12H,6-7H2,1H3
charge 0 multiplicity 1
26 atoms
O  -1.345236 -1.765587 1.476478
O  -2.362721 0.434548 -2.061958
N  -0.650865 -1.21784 -0.685883
N  3.566041 1.457911 0.567772
C  0.72659 -1.713504 -0.504692
C  1.71861 -0.612793 -0.138697
C  -2.995588 -0.761431 -0.015333
C  -1.579135 -1.278404 0.325992
C  1.635127 0.048378 1.114135
C  2.748514 -0.214937 -1.024059
C  -3.152744 0.329266 -1.078195
C  2.568419 1.062615 1.418435
C  3.638393 0.813737 -0.634036
C  -4.321106 1.280736 -0.901743
H  1.042649 -2.215401 -1.436967
H  0.688124 -2.465757 0.303762
H  -0.92162 -0.70824 -1.542139
H  -3.581539 -1.639012 -0.364384
H  -3.463278 -0.44798 0.933195
H  0.860349 -0.233093 1.835283
H  2.862257 -0.693572 -2.003853
H  -4.472377 1.877599 -1.813904
H  -5.246623 0.732242 -0.647258
H  -4.113134 1.964819 -0.055675
H  2.531787 1.58653 2.380397
H  4.442904 1.141569 -1.302572
