program: Gaussian 09
title: 000296389
version: EM64L-G09RevD.01
frameworkgroup: C1[X(C16H10N4O6)]
method: RPBEPBE
basis: SDD
operation: Freq
keyword: #p
keyword: freq=noraman
keyword: PBEPBE/SDD
title: #p freq=noraman PBEPBE/SDD
converged: NO YES NO NO
title: Mulliken charges:
elementType: O O O O O O N N N N C C C C C C C C C C C C C C C C H H H H H H H H H H
charge: -0.173909 -0.183597 -0.249611 -0.168963 -0.194388 -0.195335 -0.441115 0.023502 0.006843 0.014524 0.273209 0.201766 0.203313 0.420020 0.273026 0.368398 -0.359897 -0.372959 -0.451490 -0.561535 -0.551164 0.492475 -0.225221 -0.417049 -0.243341 -0.235843 0.360257 0.259791 0.244515 0.247816 0.343155 0.334070 0.239854 0.244708 0.237152 0.237022
chargesum: 0.00000
title: Mulliken charges with hydrogens summed into heavy atoms:
elementType: O O O O O O N N N N C C C C C C C C C C C C C C C C
charge: -0.173909 -0.183597 -0.249611 -0.168963 -0.194388 -0.195335 -0.080858 0.023502 0.006843 0.014524 0.273209 0.201766 0.203313 0.420020 0.273026 0.368398 -0.100106 -0.128444 -0.203674 -0.218380 -0.217094 0.492475 0.014633 -0.172341 -0.006190 0.001179
polarizability: 4.72440431e+02 6.02634679e+00 2.62151354e+02 1.13858650e+01 -2.37955003e+01 1.37449390e+02
1716.lowfreq: -6.3254 -0.0006 -0.0002 0.0007 3.2270 5.6260 20.1553 29.4425 43.2948
frequency: 20.0870 29.4257 43.2644 55.1470 59.8469 76.5039 94.3985 115.5787 134.3235 147.2201 166.8833 183.9116 188.4067 197.1963 237.6242 286.3346 316.4280 320.9479 347.4250 357.3590 376.1156 407.2598 435.3938 449.0724 468.8739 493.5604 496.2969 515.8430 522.2524 539.4469 556.1015 594.6027 628.5918 643.8291 649.0346 673.2393 676.4739 696.8123 699.5572 732.7133 737.2092 744.5268 761.5097 779.3100 782.0042 799.9695 812.4449 837.5118 873.0980 875.4817 895.4278 905.0138 918.6179 965.3631 966.2695 976.8530 985.8525 999.5014 1022.7258 1048.9880 1073.4421 1089.4253 1129.5864 1151.3994 1159.3866 1162.4142 1179.7481 1186.9217 1195.1064 1223.0712 1238.5115 1251.5099 1277.5820 1305.8717 1341.6585 1349.8138 1370.1509 1374.5027 1384.6891 1409.4074 1421.3702 1441.6692 1443.2695 1455.5129 1486.4312 1516.0832 1528.8078 1576.4412 1585.7550 1595.6265 1615.4280 1633.9248 3129.7731 3135.1148 3137.8231 3142.3352 3152.0268 3168.1053 3169.3478 3171.2631 3182.9256 3186.5991
redmass: 7.3405 9.4260 6.8306 10.2289 15.5340 8.2696 10.3942 9.4456 5.6655 11.8547 7.1649 4.5574 10.9241 5.6787 4.9853 7.4775 8.1219 13.2493 7.5457 8.6381 9.9670 4.0428 4.1540 5.5388 3.2583 7.2520 6.5101 5.9329 7.6823 5.7087 3.5367 5.8110 4.2868 6.5501 7.8013 9.6066 9.3351 8.0952 6.2194 6.5466 12.3842 1.3737 4.7446 2.7228 4.7585 2.6843 1.9276 1.3957 3.3602 2.7235 2.7644 7.3137 1.5077 1.4789 1.3784 1.3940 1.3778 1.3603 3.2349 2.5561 1.7005 2.1006 7.8884 1.4898 3.0547 2.7014 1.0964 1.2843 7.8488 8.6285 1.7956 2.1268 1.9048 2.5510 3.5900 4.9062 4.2482 8.7596 4.4764 3.2551 7.0098 4.0336 3.2584 2.4948 4.5372 3.7370 3.1509 5.5123 4.4000 4.2412 8.6084 6.2964 1.0865 1.0870 1.0883 1.0921 1.0952 1.0992 1.1002 1.0783 1.0924 1.0922
irintensity: 0.1444 0.0199 0.4410 1.0042 0.0305 0.4324 2.4585 7.3719 0.4047 1.9250 2.0688 1.6348 3.0579 0.8187 2.2839 2.6332 1.0225 0.5288 2.1852 0.3226 1.7659 2.7520 7.8429 5.0250 0.0364 4.1985 13.7775 5.8701 2.0478 11.9585 10.3880 8.8302 2.2796 2.2633 3.0927 24.2148 11.1904 7.0407 9.8298 3.2603 1.6190 3.6223 10.7393 38.1752 7.8141 47.6441 29.6000 71.1335 12.7286 0.7280 15.7874 5.8969 4.7739 17.4909 1.9648 15.6853 1.1226 0.9089 8.8364 5.6885 55.5281 4.2077 110.9102 6.4900 213.0847 112.5631 4.2095 21.5681 390.9978 409.7621 5.5027 13.3158 0.1749 102.9530 68.9537 178.8441 37.2405 43.5678 48.7845 2.9116 15.4655 8.0802 11.3365 1.7533 55.3780 33.1998 22.5419 56.5673 98.4539 8.6935 346.8681 4.9082 1.8480 0.1820 1.0158 9.1657 27.9899 31.3532 21.4841 99.6014 24.7901 29.1317
temp: 298.150 k
press: 1.00000 atm
elementType: 8 8 8 8 8 8 7 7 7 7 6 6 6 6 6 6 6 6 6 6 6 6 6 6 6 6 1 1 1 1 1 1 1 1 1 1
symmnumber: 1
zpe: 640306.5 jmol-1
zpe.correction: 0.243880 hartree
zpe.thermalcorrener: 0.264741 hartree
zpe.thermalcorrenthalpy: 0.265685 hartree
zpe.thermalcorrgfe: 0.192234 hartree
zpe.sumelectzpe: -1284.007127 hartree
zpe.sumelectthermal: -1283.986265 hartree
zpe.sumelectthermalent: -1283.985321 hartree
zpe.sumelectthermalfe: -1284.058773 hartree
dipole: -6.4739 0.1263 1.1054
dipole: 6.5688
quadrupole: -157.0401 -167.7932 -144.1600
quadrupole: 1.4291 -1.9550 -13.4627
quadrupole: -0.7090 -11.4621 12.1711 1.4291 -1.9550 -13.4627
hfenergy: -1284.2510065 hartree
pointgroup: C01 [X(C16H10N4O6)]
dipole: -2.5459731 0.0945242 0.4336621 debye
polarizability: 469.7807336|28.3721959|205.1891474|0.4850666|-67.2158352|197.071295 unknown
InChI: InChI=1S/C16H10N4O6/c21-18(22)11-8-14(19(23)24)16(15(9-11)20(25)26)17-13-7-3-5-10-4-1-2-6-12(10)13/h1-9,17H
charge 0 multiplicity 1
36 atoms
O  2.273317 3.549513 -1.564079
O  0.915332 -2.914661 1.268036
O  0.101221 2.869306 -1.532494
O  -0.465865 -2.216575 -0.413984
O  5.890629 0.701105 -0.339708
O  5.502239 -1.366598 0.559148
N  -0.517113 0.705676 -0.223652
N  1.379662 2.66476 -1.298748
N  0.552329 -2.068943 0.363506
N  5.104991 -0.245509 0.053325
C  -1.563751 0.114862 0.549297
C  -2.875259 0.021663 -0.044957
C  0.814248 0.396631 -0.260773
C  -3.968475 -0.44055 0.785686
C  1.789829 1.37931 -0.72236
C  1.389454 -0.861658 0.172459
C  -1.350534 -0.239197 1.890142
C  -3.134566 0.350195 -1.414667
C  -3.716384 -0.81059 2.147051
C  3.175235 1.167128 -0.622454
C  2.764624 -1.062364 0.302711
C  3.652098 -0.033703 -0.079227
C  -2.430501 -0.717268 2.685022
C  -5.283412 -0.525123 0.220249
C  -4.428758 0.25967 -1.935107
C  -5.513678 -0.175953 -1.111635
H  -0.732399 1.576704 -0.754836
H  -0.36119 -0.116209 2.343926
H  -2.310354 0.650558 -2.070014
H  -4.550145 -1.165206 2.763421
H  3.869816 1.941756 -0.958181
H  3.150367 -2.021918 0.658464
H  -2.243744 -0.992597 3.727621
H  -6.107353 -0.873822 0.853616
H  -4.613882 0.512709 -2.984352
H  -6.521631 -0.243405 -1.534251
