program: Gaussian 09
title: 000296332
version: EM64L-G09RevD.01
frameworkgroup: C1[X(C11H14N2O2)]
method: RPBEPBE
basis: SDD
operation: Freq
keyword: #p
keyword: freq=noraman
keyword: PBEPBE/SDD
title: #p freq=noraman PBEPBE/SDD
converged: YES YES NO NO
title: Mulliken charges:
elementType: O O N N C C C C C C C C C C C H H H H H H H H H H H H H H
charge: -0.291360 -0.242362 -0.346349 -0.052603 -0.517096 0.145840 -0.608174 0.238875 -0.303342 0.148856 -0.183094 -0.302346 0.274957 -0.784303 -0.766490 0.245448 0.244922 0.356831 0.268945 0.259620 0.282147 0.235851 0.235788 0.225943 0.227958 0.252734 0.261038 0.242713 0.249054
chargesum: 0.00000
title: Mulliken charges with hydrogens summed into heavy atoms:
elementType: O O N N C C C C C C C C C C C
charge: -0.291360 -0.242362 0.010483 -0.052603 -0.026726 0.145840 -0.079609 0.238875 -0.021195 0.148856 0.052756 -0.066558 0.274957 -0.077669 -0.013686
polarizability: 1.60998812e+02 1.81340405e+01 1.29545370e+02 1.40635443e+00 -1.17699878e+01 1.15971212e+02
1716.lowfreq: -42.0618 -4.6693 -0.0009 -0.0006 -0.0003 3.6459 6.7871 17.2685 23.2182
frequency: -42.0232 17.1119 23.0981 46.6914 65.1397 85.0412 140.8675 147.9417 179.3127 196.0312 231.0433 271.9283 305.3255 344.9330 374.2232 413.4421 438.8380 459.4378 528.1958 539.8471 555.6947 564.6006 643.4008 689.2262 719.8470 764.9348 789.9389 808.0186 820.5595 847.3460 890.7020 912.2587 930.3709 952.7038 968.7821 984.4944 1000.6834 1022.9650 1024.8822 1047.7100 1069.0138 1090.9673 1164.5388 1173.1877 1183.0695 1228.4319 1242.7580 1253.5588 1273.8254 1310.0739 1322.4136 1354.7825 1372.6913 1388.6139 1401.9737 1418.3374 1440.8705 1441.4748 1447.7730 1452.5902 1465.1768 1470.3329 1519.7285 1572.8428 1582.6351 1605.4657 1630.0542 2976.9941 2982.0313 2982.6752 3027.9865 3060.4326 3064.4401 3082.1691 3098.3163 3115.8092 3127.0834 3130.6505 3149.6146 3165.5910 3390.9672
redmass: 1.0218 4.0692 3.9005 5.0268 3.6702 4.3623 2.7097 1.4992 3.8472 3.4624 4.1673 4.7961 2.6294 3.0024 4.1729 2.9100 3.3811 2.2744 4.4089 4.7000 3.9641 3.6549 4.9077 3.9564 4.7191 1.7985 1.3760 2.2859 2.0407 1.9759 2.3434 2.9717 1.3701 3.9607 1.9289 2.1045 1.3427 1.9809 2.0685 1.5953 4.4835 1.5597 1.4550 1.1467 1.7480 1.8008 2.7122 1.5305 3.4650 1.8371 3.5100 1.3332 1.2488 1.2902 2.3089 1.0912 1.1411 1.0998 2.2395 1.0543 1.1339 1.0517 1.7844 6.3274 5.4412 6.9827 6.2540 1.0645 1.0405 1.0382 1.0588 1.0972 1.0954 1.0917 1.1049 1.0981 1.1003 1.0874 1.0940 1.0999 1.0809
irintensity: 0.3811 0.3395 0.7802 0.8445 6.0324 15.9731 2.3459 0.3834 0.8544 4.0976 13.6504 7.3733 2.3088 7.6725 3.2225 14.1101 3.2710 7.8350 8.5694 4.7064 8.2023 9.0200 7.2569 6.9031 1.8825 36.6037 76.1796 18.5153 19.8219 31.3129 1.2094 3.2007 2.7637 1.9174 8.7198 2.9024 1.3514 9.6503 13.1683 10.8980 1.5487 11.6055 45.7668 2.0859 11.1190 0.5411 100.6063 14.1575 4.7061 56.5374 1.1652 5.2518 69.8278 16.2479 9.7199 55.7975 55.2031 9.6609 40.9135 18.5015 20.5614 15.8383 293.0693 60.8999 41.0418 31.3823 231.4761 1.1542 2.0830 22.3639 24.7631 20.4709 9.0835 5.9970 4.2443 9.6314 10.7721 7.3585 14.1439 9.9697 182.4942
temp: 298.150 k
press: 1.00000 atm
elementType: 8 8 7 7 6 6 6 6 6 6 6 6 6 6 6 1 1 1 1 1 1 1 1 1 1 1 1 1 1
symmnumber: 1
zpe: 609972.9 jmol-1
zpe.correction: 0.232326 hartree
zpe.thermalcorrener: 0.246950 hartree
zpe.thermalcorrenthalpy: 0.247895 hartree
zpe.thermalcorrgfe: 0.187828 hartree
zpe.sumelectzpe: -686.424068 hartree
zpe.sumelectthermal: -686.409444 hartree
zpe.sumelectthermalent: -686.408500 hartree
zpe.sumelectthermalfe: -686.468566 hartree
dipole: -1.3598 1.3075 2.0547
dipole: 2.7893
quadrupole: -65.4649 -99.0793 -83.8725
quadrupole: -2.4750 1.1955 3.5994
quadrupole: 17.3407 -16.2737 -1.0669 -2.4750 1.1955 3.5994
hfenergy: -686.6563943 hartree
pointgroup: C01 [X(C11H14N2O2)]
dipole: -0.4060622 0.1288234 -1.0113434 debye
polarizability: 169.0696044|-0.0194166|129.3609907|-5.3064706|4.0750006|108.0847987 unknown
InChI: InChI=1S/C11H14N2O2/c1-8-4-3-5-10(13-8)7-12-11(15)6-9(2)14/h3-5,12H,6-7H2,1-2H3
charge 0 multiplicity 1
29 atoms
O  -2.534853 0.905616 1.331031
O  -1.839266 -2.260201 -1.477078
N  -1.131559 -0.890938 0.824659
N  2.144253 -0.146282 0.708895
C  -0.058853 -0.472592 1.7494
C  0.968537 0.442949 1.090781
C  -3.342674 -0.730857 -0.291092
C  -2.283905 -0.159659 0.682257
C  0.696073 1.817063 0.880515
C  3.09994 0.622153 0.097656
C  1.682765 2.607836 0.251095
C  2.897365 2.006857 -0.144905
C  -2.863533 -1.51771 -1.513227
C  4.386795 -0.07127 -0.30262
C  -3.690344 -1.374015 -2.777977
H  0.461249 -1.374869 2.110909
H  -0.54147 0.044546 2.596703
H  -0.981501 -1.6764 0.173386
H  -3.987534 -1.414835 0.301535
H  -3.987637 0.109732 -0.596057
H  -0.26643 2.230233 1.197873
H  1.50837 3.674958 0.07508
H  3.682776 2.593994 -0.633206
H  4.594455 0.056316 -1.381257
H  5.252724 0.341705 0.248489
H  4.31073 -1.146787 -0.080137
H  -3.373106 -2.110966 -3.531316
H  -4.768219 -1.492409 -2.561291
H  -3.558847 -0.354765 -3.1911
