program: Gaussian 09
title: 000296328
version: EM64L-G09RevD.01
frameworkgroup: C1[X(C10H12N2O2)]
method: RPBEPBE
basis: SDD
operation: Freq
keyword: #p
keyword: freq=noraman
keyword: PBEPBE/SDD
title: #p freq=noraman PBEPBE/SDD
converged: NO YES NO NO
title: Mulliken charges:
elementType: O O N N C C C C C C C C C C H H H H H H H H H H H H
charge: -0.192689 -0.257573 -0.437400 0.011924 0.066631 0.283105 -0.629562 0.201563 -0.314031 -0.810604 0.282560 -0.180731 -0.343440 -0.770065 0.270668 0.261245 0.374924 0.238539 0.246271 0.239661 0.229252 0.229191 0.242143 0.251260 0.260369 0.246788
chargesum: 0.00000
title: Mulliken charges with hydrogens summed into heavy atoms:
elementType: O O N N C C C C C C C C C C
charge: -0.192689 -0.257573 -0.062476 0.011924 0.066631 0.283105 -0.097649 0.201563 -0.075492 -0.095419 0.282560 0.048460 -0.101297 -0.011647
polarizability: 1.91899052e+02 -6.77460134e-01 1.37179620e+02 -5.33423363e-02 -2.68906871e-01 6.93177307e+01
1716.lowfreq: -9.2980 -6.9336 0.0003 0.0004 0.0005 4.4482 19.7871 41.6504 65.6918
frequency: 19.0684 41.6352 65.6569 83.7042 102.9414 147.8635 171.7529 174.0945 191.9884 252.8231 284.6732 308.9806 368.5877 424.3620 445.1714 463.1496 514.5307 530.5313 541.4576 573.2527 597.7592 671.9545 760.4173 787.4286 795.3197 810.8518 837.5582 861.9269 907.3971 915.7703 927.5169 970.1865 979.1527 986.8150 1018.0989 1043.1784 1055.4746 1104.3019 1146.0532 1160.0710 1178.6994 1202.4312 1270.5438 1300.6129 1308.8644 1330.9977 1373.0497 1403.9680 1421.1316 1422.9983 1426.5820 1441.0644 1450.6693 1471.1899 1476.6911 1524.1252 1564.1754 1591.5258 1609.2965 1663.8694 2972.1590 2980.2850 2982.9979 3048.2860 3062.8235 3088.2028 3097.2695 3126.1816 3128.8627 3134.6843 3168.7812 3312.5856
redmass: 4.1536 4.3867 3.8948 4.1793 3.6647 1.2124 1.1043 3.0837 6.1091 4.3010 4.1015 3.3433 3.5222 3.8320 3.8346 2.7345 4.5726 3.3987 4.1499 4.0725 4.8664 5.2604 4.6365 2.9116 1.4098 1.9742 1.6939 2.9171 2.3334 4.9318 1.3435 1.3798 1.8451 1.6480 1.7804 1.5504 2.4789 1.9132 1.5523 2.2952 1.7161 2.2996 1.9106 2.1572 2.2187 5.1704 1.2505 1.2747 2.4541 1.1031 2.1169 1.0783 1.0548 1.0632 1.2064 2.1620 4.0485 5.5552 4.3479 4.9018 1.0389 1.0453 1.0591 1.0960 1.0954 1.0985 1.0933 1.1002 1.0875 1.0924 1.0996 1.0801
irintensity: 0.2349 3.9981 8.2612 2.9504 6.9517 0.6008 1.5661 0.6967 8.2558 1.0846 5.0826 1.1115 1.9320 4.5562 0.7194 4.0117 21.4946 7.1407 6.7330 5.9212 7.5435 0.7437 6.3322 16.4564 58.4584 25.7827 71.7647 6.8016 3.8723 13.0664 0.5276 0.4323 25.2995 11.5794 20.5947 7.7742 1.7199 4.5375 11.1632 133.7603 2.3302 124.0851 7.9463 97.9271 26.9522 41.7952 78.3782 19.3123 78.2823 59.0626 13.3492 29.1440 19.2836 27.3956 164.1235 268.9349 376.8529 25.3308 5.4521 219.3169 18.1537 0.5313 0.8562 15.8641 7.1611 22.4227 9.0786 11.0184 5.6684 25.9863 31.1801 260.5690
temp: 298.150 k
press: 1.00000 atm
elementType: 8 8 7 7 6 6 6 6 6 6 6 6 6 6 1 1 1 1 1 1 1 1 1 1 1 1
symmnumber: 1
zpe: 535801.8 jmol-1
zpe.correction: 0.204076 hartree
zpe.thermalcorrener: 0.217988 hartree
zpe.thermalcorrenthalpy: 0.218932 hartree
zpe.thermalcorrgfe: 0.161661 hartree
zpe.sumelectzpe: -647.195075 hartree
zpe.sumelectthermal: -647.181164 hartree
zpe.sumelectthermalent: -647.180219 hartree
zpe.sumelectthermalfe: -647.237490 hartree
dipole: 2.1532 3.3700 -0.6029
dipole: 4.0444
quadrupole: -54.9870 -91.8404 -83.4542
quadrupole: -6.1979 -0.8337 4.1553
quadrupole: 21.7736 -15.0799 -6.6937 -6.1979 -0.8337 4.1553
hfenergy: -647.3991513 hartree
pointgroup: C01 [X(C10H12N2O2)]
dipole: 0.6914028 -1.4304356 0.0873994 debye
dipolederiv: -0.596738 0.0731485 -0.0529379 -0.4219024 -0.9831944 0.1069474 -0.0396556 0.2390603 -0.3583685 -0.8371296 -0.1766619 0.0473942 0.0508575 -0.8243452 -0.014621 0.086004 -0.0436082 -0.3149933 -2.0627783 -0.3006265 -0.1256444 -0.3981636 -0.6092166 0.0020885 -0.1954593 0.028754 -0.3713188 -0.5705737 0.0040639 -0.0577167 0.3396488 -0.2932084 -0.0020426 0.001165 -0.0670057 -0.2189234 1.65979 0.0701321 0.1439966 -0.0400054 0.0519084 0.0358356 0.2983472 0.0491925 0.1616333 -0.4436364 -0.1184373 -0.0591821 -0.3955354 0.1568091 -0.0034704 -0.1356216 0.0233039 -0.0314083 -0.607073 0.3672945 -0.0399121 0.474928 -0.4091851 -0.0575516 -0.1264352 -0.1397693 -0.0593505 1.8184646 -0.0083757 0.193399 0.9636262 1.2739346 -0.2309879 0.3304306 -0.3296888 0.3176712 0.246119 0.0772916 0.0581326 -0.0480415 0.0955418 0.0584812 0.0570383 0.0746036 -0.1196689 -0.0155019 0.1073716 0.0265712 0.0908548 -0.0692028 -0.0214209 0.0264727 -0.0032092 0.0678587 1.0764817 0.0390593 -0.2640681 -0.304224 1.0493174 0.1491572 -0.4481719 0.258105 0.2079189 -0.0663456 -0.0828214 -0.0028797 0.1770665 -0.2457556 -0.0230642 0.0555385 -0.0407282 -0.1436127 0.1951476 0.0209439 0.0666838 -0.2538423 0.337434 0.0808448 -0.0462289 0.0987636 -0.0642206 -0.5505308 0.0437053 0.1461143 -0.0384071 0.0062682 0.0076114 0.2837018 -0.053221 -0.0204526 0.1330046 -0.0301616 0.0130427 -0.0027059 0.0971352 0.0280655 0.0063134 0.0012189 -0.0088657 -0.0535064 -0.0286995 0.028451 -0.0684179 0.0323653 0.024148 0.0519731 0.0572911 0.1035278 0.4938624 -0.0740412 0.0106368 -0.2924773 0.2486068 0.0089911 -0.1001992 -0.0098027 0.2626093 0.038868 -0.0667744 -0.0297447 -0.1048868 -0.0464737 -0.0632508 -0.0475954 -0.0574705 0.1225291 0.0053571 0.0369159 0.1190692 -0.0004456 0.0508813 0.0343116 0.1252144 0.0010717 0.0191293 0.0836757 0.0830216 -0.0696168 0.0616072 0.0258267 0.0183212 -0.0860142 0.0669951 -0.0577084 -0.0380687 -0.1589392 -0.0745716 -0.0467292 -0.0242168 -0.0530747 -0.0458142 -0.0795686 0.0802101 -0.1249974 0.0422475 -0.0326076 0.0244161 0.0937264 -0.0167847 -0.0384191 -0.0087854 0.1623672 0.0146447 0.0725528 0.0045961 0.1219858 -0.0673215 -0.0369035 0.0201992 -0.0416642 0.1275886 0.0853357 0.0237614 -0.0124285 0.0334658 0.051955 0.0936745 0.0402052 0.0733059 0.0021874 0.062813 0.0145004 0.0108302 0.088939 -0.0742678 -0.0331881 0.0248506 -0.0297531 0.1217158 0.0533158 -0.0304716 -0.0476075 -0.0116113 0.0746777 -0.0921176 -0.0978394 -0.0673906 0.0119448 unknown
polarizability: 190.8386845|-5.94474|136.4185505|8.1275416|8.8462164|71.1391683 unknown
InChI: InChI=1S/C10H12N2O2/c1-7-4-3-5-11-10(7)12-9(14)6-8(2)13/h3-5,12H,6H2,1-2H3
charge 0 multiplicity 1
26 atoms
O  1.088496 2.151282 -0.012905
O  2.286898 -1.903932 0.419448
N  0.264059 -0.029286 0.439142
N  -1.706528 1.310985 0.465211
C  -1.134702 0.099722 0.229021
C  -1.867679 -1.064692 -0.175771
C  2.644058 0.476201 0.842414
C  1.240876 0.962904 0.364109
C  -3.262154 -0.905113 -0.336996
C  -1.182599 -2.393852 -0.425416
C  3.090166 -0.920605 0.414818
C  -3.873199 0.351318 -0.1134
C  -3.05139 1.427711 0.283615
C  4.534203 -1.084995 -0.014082
H  2.618919 0.488485 1.952837
H  3.372031 1.240274 0.527833
H  0.643336 -0.981098 0.585169
H  -3.866024 -1.765521 -0.647964
H  -0.354161 -2.297939 -1.152065
H  -0.747778 -2.819912 0.500125
H  -1.898955 -3.133031 -0.821875
H  -4.950753 0.491599 -0.24099
H  -3.470082 2.422106 0.476034
H  4.710006 -0.523306 -0.952351
H  4.770872 -2.147417 -0.177405
H  5.21938 -0.657691 0.741841
